program: Orca
programVersion: 5.0.2
elementType: Br Br O O O C C C C C C C C C C C C C C C C C H H H H H H H H H H H H H H H H
charge: 0
multiplicity: 1
keywords: wb97x-d3
keywords: def2-TZVPP
keywords: def2/J RIJCOSX
keywords: DEFGRID2
keywords: scfconv7
keywords: smallprint printgap noloewdin
keywords: NOSOSCF
formula: C17H16Br2O3
InChI: InChI=1/C17H16Br2O3/c1-11(2)22-16(20)17(21,12-3-7-14(18)8-4-12)13-5-9-15(19)10-6-13/h3-11,21H,1-2H3
38 atoms
Br 5.027807 -2.498887 -0.324834
Br -5.166621 -1.643053 0.206658
O  -0.040106 3.574544 0.349107
O  0.216043 2.017672 -1.734364
O  0.938416 2.088432 1.706476
C  0.20275 1.375401 -0.487931
C  1.371775 0.400291 -0.470767
C  -1.127542 0.653091 -0.266879
C  0.425689 2.38675 0.655472
C  -0.042625 4.625009 1.355465
C  2.5001 0.642716 -1.24758
C  -1.713994 0.012186 -1.356195
C  1.358632 -0.719067 0.353585
C  -1.771308 0.590052 0.963616
C  3.589862 -0.215242 -1.209088
C  -2.910721 -0.673089 -1.225766
C  2.440063 -1.584957 0.404628
C  -2.972348 -0.090422 1.109773
C  0.049245 5.934116 0.606245
C  -1.303377 4.502598 2.184951
C  3.552472 -1.324361 -0.379833
C  -3.535555 -0.716995 0.012293
H  0.839195 4.504961 1.98663
H  2.556877 1.505364 -1.895991
H  -1.23892 0.034272 -2.327791
H  0.498308 -0.941493 0.97067
H  -1.357225 1.056143 1.84695
H  -0.548498 2.603194 -1.805741
H  4.451507 -0.005858 -1.828465
H  -3.339787 -1.162211 -2.089928
H  2.401565 -2.445649 1.058506
H  -3.44862 -0.118461 2.080318
H  0.071856 6.754887 1.322562
H  0.959568 5.991233 0.009325
H  -0.809934 6.085037 -0.048581
H  -1.361689 3.547119 2.706698
H  -2.194648 4.615659 1.56626
H  -1.316236 5.289463 2.939248
elementType: Br O C H
totalener: -6031.65629574 hartree
nucrepener: 2551.62851772 hartree
electener: -8583.28481346 hartree
twoeener: 4862.55864253 hartree
cpcmener: -0.02896839 hartree
kineticenergy: 6020.54214796 hartree
xcener: -225.564991369085 hartree
chargesum: 0.0000000
charge: -0.044455 -0.040545 -0.283847 -0.403820 -0.454428 0.678335 0.001713 -0.073218 0.309768 0.156006 -0.233128 -0.241756 -0.211081 -0.192569 -0.122791 -0.118638 -0.125023 -0.127438 -0.256074 -0.264275 -0.013806 -0.004304 0.071766 0.145413 0.140797 0.158612 0.154331 0.232637 0.146555 0.146396 0.145556 0.145671 0.094779 0.099263 0.090724 0.095782 0.092212 0.104880
qa: -0.0445 -0.0405 -0.2838 -0.4038 -0.4544 0.6783 0.0017 -0.0732 0.3098 0.1560 -0.2331 -0.2418 -0.2111 -0.1926 -0.1228 -0.1186 -0.1250 -0.1274 -0.2561 -0.2643 -0.0138 -0.0043 0.0718 0.1454 0.1408 0.1586 0.1543 0.2326 0.1466 0.1464 0.1456 0.1457 0.0948 0.0993 0.0907 0.0958 0.0922 0.1049
va: 1.2151 1.2186 2.1860 2.0248 2.0333 3.4993 3.6078 3.6601 4.3202 3.8025 4.0843 4.0570 4.0205 3.9186 3.8865 3.8862 3.9244 3.9457 3.9413 3.9144 3.9409 3.9551 1.0237 1.0264 1.0260 0.9921 1.0098 1.0110 0.9992 0.9993 0.9994 1.0002 1.0047 1.0069 1.0061 1.0108 1.0074 1.0071
dispcorr: -0.020452002 hartree
energy: -6031.676747744792
dipole: -2.25939 1.05713 -1.20226 73.73681 -71.69186 2.04495 7.30861 -7.44468 -0.13608
magnitude: 2.37608 au
magnitude: 6.03952 debye
