program: Orca
programVersion: 5.0.2
elementType: Br Br O O O C C C C C C C C C C C C C C C C C H H H H H H H H H H H H H H H H
charge: 0
multiplicity: 1
keywords: wb97x-d3
keywords: def2-TZVPP
keywords: def2/J RIJCOSX
keywords: DEFGRID2
keywords: scfconv7
keywords: smallprint printgap noloewdin
keywords: NOSOSCF
formula: C17H16Br2O3
InChI: InChI=1/C17H16Br2O3/c1-11(2)22-16(20)17(21,12-3-7-14(18)8-4-12)13-5-9-15(19)10-6-13/h3-11,21H,1-2H3
38 atoms
Br 5.244979 -2.058431 -0.081453
Br -5.051948 -1.526296 1.034133
O  -0.208316 2.670835 0.491174
O  -0.09719 1.140089 -2.674152
O  0.434073 3.472608 -1.496982
C  0.050188 1.105962 -1.284817
C  1.329191 0.350963 -0.913585
C  -1.190152 0.425236 -0.720659
C  0.112153 2.562685 -0.777242
C  -0.172583 3.975288 1.131552
C  2.196255 0.734067 0.102745
C  -1.159538 -0.235818 0.502183
C  1.644205 -0.783684 -1.659446
C  -2.395999 0.49386 -1.41104
C  3.357536 0.01715 0.363113
C  -2.301318 -0.816561 1.031337
C  2.796121 -1.509927 -1.410619
C  -3.546267 -0.087703 -0.897321
C  -1.469493 4.707333 0.857376
C  0.053249 3.712194 2.603132
C  3.654683 -1.096425 -0.402438
C  -3.491453 -0.738043 0.324367
H  0.67088 4.538551 0.726288
H  1.997011 1.595376 0.724906
H  -0.239335 -0.312583 1.066455
H  0.989522 -1.117428 -2.453455
H  -2.464268 1.005723 -2.360645
H  0.624275 1.654416 -3.057686
H  4.013882 0.345144 1.158232
H  -2.247042 -1.322705 1.985928
H  3.014449 -2.383064 -2.01106
H  -4.468999 -0.023089 -1.45861
H  -2.324765 4.150592 1.243865
H  -1.449257 5.678287 1.353241
H  -1.624179 4.886925 -0.206511
H  -0.759876 3.128426 3.037636
H  0.105498 4.661457 3.136375
H  0.991629 3.184266 2.77795
elementType: Br O C H
totalener: -6031.66868645 hartree
nucrepener: 2573.80722717 hartree
electener: -8605.47591362 hartree
twoeener: 4884.23296003 hartree
cpcmener: -0.02265807 hartree
kineticenergy: 6020.54294573 hartree
xcener: -225.563418925246 hartree
chargesum: -0.0000000
charge: -0.039791 -0.042950 -0.265935 -0.389490 -0.435215 0.665824 -0.089038 0.011612 0.316996 0.133903 -0.177537 -0.211005 -0.244841 -0.231653 -0.126860 -0.115473 -0.116456 -0.114087 -0.256923 -0.260109 -0.006453 -0.022321 0.074571 0.136083 0.149616 0.138908 0.142980 0.221801 0.142208 0.143671 0.145224 0.144207 0.091250 0.100755 0.098549 0.090829 0.098805 0.098344
qa: -0.0398 -0.0430 -0.2659 -0.3895 -0.4352 0.6658 -0.0890 0.0116 0.3170 0.1339 -0.1775 -0.2110 -0.2448 -0.2317 -0.1269 -0.1155 -0.1165 -0.1141 -0.2569 -0.2601 -0.0065 -0.0223 0.0746 0.1361 0.1496 0.1389 0.1430 0.2218 0.1422 0.1437 0.1452 0.1442 0.0912 0.1008 0.0985 0.0908 0.0988 0.0983
va: 1.2188 1.2166 2.1657 2.0467 2.0798 3.4744 3.6433 3.5828 4.3029 3.8089 3.9385 4.0001 4.0648 4.0837 3.9433 3.9143 3.8870 3.8845 3.9138 3.9396 3.9571 3.9566 1.0209 1.0200 0.9966 1.0277 1.0288 1.0232 1.0006 0.9993 0.9994 0.9997 1.0061 1.0064 1.0147 1.0058 1.0063 1.0048
dispcorr: -0.020937171 hartree
energy: -6031.689623618171
dipole: -4.70026 4.99767 0.29741 61.34249 -60.36489 0.97760 -3.65140 4.60075 0.94935
magnitude: 1.39478 au
magnitude: 3.54525 debye
