program: Orca
programVersion: 5.0.2
elementType: Br Br O O O C C C C C C C C C C C C C C C C C H H H H H H H H H H H H H H H H
charge: 0
multiplicity: 1
keywords: wb97x-d3
keywords: def2-TZVPP
keywords: def2/J RIJCOSX
keywords: DEFGRID2
keywords: scfconv7
keywords: smallprint printgap noloewdin
keywords: NOSOSCF
formula: C17H16Br2O3
InChI: InChI=1/C17H16Br2O3/c1-11(2)22-16(20)17(21,12-3-7-14(18)8-4-12)13-5-9-15(19)10-6-13/h3-11,21H,1-2H3
38 atoms
Br 5.193381 -2.541763 -0.441426
Br -5.172467 -1.563244 0.327199
O  -0.261829 3.410705 0.117549
O  0.34969 1.895127 -1.810969
O  0.680685 2.069831 1.64255
C  0.283332 1.226412 -0.581117
C  1.470466 0.281028 -0.458008
C  -1.059428 0.524369 -0.371758
C  0.287958 2.29179 0.525084
C  -0.503511 4.477079 1.072952
C  1.349185 -1.062636 -0.794318
C  -2.115733 0.737887 -1.246521
C  2.738749 0.774589 -0.15885
C  -1.261263 -0.295286 0.736495
C  2.449762 -1.908115 -0.795893
C  -3.343741 0.120858 -1.045451
C  3.848043 -0.055099 -0.151216
C  -2.479773 -0.91543 0.951996
C  -0.617695 5.746282 0.259036
C  -1.759283 4.175392 1.864501
C  3.693099 -1.397978 -0.463474
C  -3.515546 -0.704612 0.052417
H  0.356668 4.548205 1.742056
H  0.387607 -1.480682 -1.061496
H  -1.999969 1.387506 -2.103307
H  2.888676 1.821524 0.072586
H  -0.461878 -0.47061 1.445418
H  0.398942 1.237595 -2.515855
H  2.319623 -2.950497 -1.05502
H  -4.147952 0.296748 -1.747629
H  4.817699 0.355088 0.098042
H  -2.605997 -1.55579 1.814732
H  -0.779327 6.59263 0.926606
H  0.29279 5.943131 -0.308302
H  -1.457891 5.704737 -0.436456
H  -1.949672 4.988274 2.566246
H  -1.67293 3.25747 2.446029
H  -2.627244 4.089536 1.208505
elementType: Br O C H
totalener: -6031.66646610 hartree
nucrepener: 2557.21051930 hartree
electener: -8588.87698540 hartree
twoeener: 4868.02468944 hartree
cpcmener: -0.02666166 hartree
kineticenergy: 6020.54507839 hartree
xcener: -225.564360578810 hartree
chargesum: -0.0000000
charge: -0.041085 -0.041011 -0.266073 -0.379202 -0.433875 0.744128 -0.094073 -0.113496 0.298871 0.148502 -0.186061 -0.204033 -0.226826 -0.250645 -0.103609 -0.129311 -0.100892 -0.099483 -0.253996 -0.262420 -0.028141 -0.012586 0.070450 0.153847 0.140259 0.138079 0.152518 0.230272 0.144524 0.144739 0.145051 0.144807 0.092670 0.097819 0.090095 0.102301 0.097476 0.090410
qa: -0.0411 -0.0410 -0.2661 -0.3792 -0.4339 0.7441 -0.0941 -0.1135 0.2989 0.1485 -0.1861 -0.2040 -0.2268 -0.2506 -0.1036 -0.1293 -0.1009 -0.0995 -0.2540 -0.2624 -0.0281 -0.0126 0.0705 0.1538 0.1403 0.1381 0.1525 0.2303 0.1445 0.1447 0.1451 0.1448 0.0927 0.0978 0.0901 0.1023 0.0975 0.0904
va: 1.2180 1.2185 2.2106 2.0439 2.0639 3.3241 3.7463 3.4102 4.3087 3.8201 3.9862 4.0574 4.0881 4.0656 3.9012 3.9147 3.8714 3.9083 3.9452 3.9069 3.9643 3.9650 1.0196 0.9947 1.0315 1.0127 1.0077 1.0064 0.9995 1.0010 0.9985 0.9996 1.0055 1.0076 1.0062 1.0070 1.0144 1.0071
dispcorr: -0.020587199 hartree
energy: -6031.687053296424
dipole: -6.02762 5.52916 -0.49846 69.83910 -68.95504 0.88406 3.84523 -4.60177 -0.75654
magnitude: 1.26585 au
magnitude: 3.21752 debye
