program: Orca
programVersion: 5.0.2
elementType: Br Br O O O C C C C C C C C C C C C C C C C C H H H H H H H H H H H H H H H H
charge: 0
multiplicity: 1
keywords: wb97x-d3
keywords: def2-TZVPP
keywords: def2/J RIJCOSX
keywords: DEFGRID2
keywords: scfconv7
keywords: smallprint printgap noloewdin
keywords: NOSOSCF
formula: C17H16Br2O3
InChI: InChI=1/C17H16Br2O3/c1-11(2)22-16(20)17(21,12-3-7-14(18)8-4-12)13-5-9-15(19)10-6-13/h3-11,21H,1-2H3
38 atoms
Br 4.96112 -1.97538 0.365956
Br -5.09833 -2.297969 -0.572983
O  0.391566 3.5294 0.40029
O  -0.091701 2.072457 -1.736583
O  -1.016692 2.278215 1.607728
C  -0.148556 1.422836 -0.497925
C  1.12787 0.620906 -0.244413
C  -1.361948 0.504217 -0.522243
C  -0.328572 2.455382 0.636602
C  0.452899 4.591627 1.388774
C  1.723784 -0.03198 -1.320192
C  -1.480418 -0.541423 0.387373
C  1.702493 0.488602 1.014194
C  -2.387178 0.705978 -1.439175
C  2.861369 -0.802778 -1.147562
C  -2.587709 -1.374148 0.383786
C  2.844031 -0.278527 1.202951
C  -3.501312 -0.121729 -1.457743
C  1.470739 4.232577 2.451199
C  0.816119 5.847757 0.629732
C  3.415453 -0.921938 0.118585
C  -3.593433 -1.159121 -0.545741
H  -0.535695 4.707332 1.837566
H  1.30073 0.046384 -2.312923
H  -0.7016 -0.736118 1.112855
H  1.271588 0.964242 1.885886
H  -2.342039 1.512019 -2.157413
H  0.700721 2.620924 -1.780475
H  3.300403 -1.301374 -2.001398
H  -2.649296 -2.179831 1.103047
H  3.267616 -0.361555 2.194872
H  -4.27979 0.054822 -2.187795
H  1.190379 3.338039 3.007015
H  2.458291 4.075837 2.014889
H  1.547727 5.049728 3.169239
H  1.79258 5.759266 0.150679
H  0.85797 6.689612 1.320525
H  0.073643 6.083288 -0.133563
elementType: Br O C H
totalener: -6031.66810371 hartree
nucrepener: 2555.69020300 hartree
electener: -8587.35830671 hartree
twoeener: 4866.48006942 hartree
cpcmener: -0.02410238 hartree
kineticenergy: 6020.54729226 hartree
xcener: -225.564877636024 hartree
chargesum: 0.0000000
charge: -0.039553 -0.044966 -0.281773 -0.387251 -0.417106 0.631323 -0.025638 0.009792 0.289615 0.151116 -0.242087 -0.212742 -0.211509 -0.226537 -0.111226 -0.125286 -0.125089 -0.123084 -0.270535 -0.254460 -0.013078 -0.010532 0.070999 0.141492 0.157180 0.154304 0.143459 0.221888 0.144587 0.141904 0.144225 0.143228 0.097823 0.092403 0.105555 0.089480 0.093147 0.098935
qa: -0.0396 -0.0450 -0.2818 -0.3873 -0.4171 0.6313 -0.0256 0.0098 0.2896 0.1511 -0.2421 -0.2127 -0.2115 -0.2265 -0.1112 -0.1253 -0.1251 -0.1231 -0.2705 -0.2545 -0.0131 -0.0105 0.0710 0.1415 0.1572 0.1543 0.1435 0.2219 0.1446 0.1419 0.1442 0.1432 0.0978 0.0924 0.1056 0.0895 0.0931 0.0989
va: 1.2192 1.2143 2.1759 2.0379 2.0795 3.5409 3.6257 3.5981 4.3535 3.8168 4.0591 4.0259 3.9404 4.0724 3.8859 3.9312 3.9442 3.8945 3.9035 3.9383 3.9684 3.9442 1.0207 1.0246 0.9935 1.0042 1.0287 1.0214 0.9996 1.0008 1.0003 1.0002 1.0133 1.0064 1.0078 1.0062 1.0057 1.0073
dispcorr: -0.020597723 hartree
energy: -6031.688701429581
dipole: 8.04520 -6.64076 1.40443 73.94615 -72.07107 1.87508 8.76472 -8.77924 -0.01453
magnitude: 2.34277 au
magnitude: 5.95485 debye
