program: Orca
programVersion: 5.0.2
elementType: Br Br O O O C C C C C C C C C C C C C C C C C H H H H H H H H H H H H H H H H
charge: 0
multiplicity: 1
keywords: wb97x-d3
keywords: def2-TZVPP
keywords: def2/J RIJCOSX
keywords: DEFGRID2
keywords: scfconv7
keywords: smallprint printgap noloewdin
keywords: NOSOSCF
formula: C17H16Br2O3
InChI: InChI=1/C17H16Br2O3/c1-11(2)22-16(20)17(21,12-3-7-14(18)8-4-12)13-5-9-15(19)10-6-13/h3-11,21H,1-2H3
38 atoms
Br 5.113446 -1.843414 0.284057
Br -5.174112 -1.907165 0.672982
O  0.437907 2.610037 0.476186
O  -0.132639 1.157859 -2.673366
O  -0.36322 3.470514 -1.42972
C  -0.107647 1.088893 -1.279198
C  1.153149 0.331608 -0.881674
C  -1.374832 0.404954 -0.75946
C  -0.028715 2.535728 -0.751253
C  0.576804 3.905926 1.102045
C  1.185113 -0.558635 0.181822
C  -1.954345 -0.578594 -1.556172
C  2.325066 0.556567 -1.597272
C  -1.959841 0.682761 0.471058
C  2.357728 -1.210064 0.535206
C  -3.079381 -1.270383 -1.139508
C  3.504489 -0.082252 -1.253719
C  -3.091321 0.002649 0.898573
C  -0.756361 4.366352 1.660455
C  1.633703 3.736117 2.172498
C  3.51427 -0.965777 -0.18516
C  -3.645069 -0.975634 0.091883
H  0.921809 4.617481 0.347969
H  0.28899 -0.765538 0.75037
H  -1.522267 -0.814993 -2.518383
H  2.326456 1.232388 -2.441361
H  -1.540298 1.425594 1.133651
H  -0.595512 1.96908 -2.920449
H  2.357651 -1.904062 1.364419
H  -3.506582 -2.033046 -1.776167
H  4.404415 0.105838 -1.823022
H  -3.528575 0.240924 1.858383
H  -0.63722 5.341193 2.133867
H  -1.510966 4.470033 0.882111
H  -1.126281 3.675475 2.420082
H  1.816241 4.691087 2.664601
H  2.575977 3.389207 1.750032
H  1.316533 3.022171 2.933411
totalener: -6031.64582103 hartree
nucrepener: 2578.03779801 hartree
electener: -8609.68361904 hartree
twoeener: 4888.06021158 hartree
kineticenergy: 6020.60132967 hartree
xcener: -225.573600777830 hartree
chargesum: -0.0000000
charge: -0.030657 -0.025380 -0.261915 -0.357183 -0.369449 0.612656 -0.029089 -0.086609 0.302476 0.113257 -0.157787 -0.195466 -0.201339 -0.213940 -0.106046 -0.097367 -0.093642 -0.095511 -0.279077 -0.229024 -0.027300 -0.021931 0.077035 0.133153 0.130299 0.123871 0.121061 0.196563 0.124362 0.128183 0.126020 0.123240 0.099245 0.116441 0.082297 0.085014 0.099246 0.084296
qa: -0.0307 -0.0254 -0.2619 -0.3572 -0.3694 0.6127 -0.0291 -0.0866 0.3025 0.1133 -0.1578 -0.1955 -0.2013 -0.2139 -0.1060 -0.0974 -0.0936 -0.0955 -0.2791 -0.2290 -0.0273 -0.0219 0.0770 0.1332 0.1303 0.1239 0.1211 0.1966 0.1244 0.1282 0.1260 0.1232 0.0992 0.1164 0.0823 0.0850 0.0992 0.0843
va: 1.2284 1.2326 2.1535 2.0717 2.1348 3.5748 3.6721 3.7130 4.2672 3.8556 4.0035 4.0597 4.1045 3.9833 3.9464 3.8939 3.8911 3.9566 3.9080 3.9351 4.0376 4.0481 1.0190 1.0001 1.0346 1.0355 1.0304 1.0582 1.0064 1.0055 1.0053 1.0078 1.0103 1.0115 1.0043 1.0080 1.0104 1.0078
dispcorr: -0.020976736 hartree
energy: -6031.666797768803
dipole: 2.47106 -2.42845 0.04261 61.73005 -60.74561 0.98444 -2.61660 3.34077 0.72417
magnitude: 1.22285 au
magnitude: 3.10824 debye
