program: Orca
programVersion: 5.0.2
elementType: Br Br O O O C C C C C C C C C C C C C C C C C H H H H H H H H H H H H H H H H
charge: 0
multiplicity: 1
keywords: wb97x-d3
keywords: def2-TZVPP
keywords: def2/J RIJCOSX
keywords: DEFGRID2
keywords: scfconv7
keywords: smallprint printgap noloewdin
keywords: NOSOSCF
formula: C17H16Br2O3
InChI: InChI=1/C17H16Br2O3/c1-11(2)22-16(20)17(21,12-3-7-14(18)8-4-12)13-5-9-15(19)10-6-13/h3-11,21H,1-2H3
38 atoms
Br 5.126278 -2.538139 -0.502878
Br -5.185779 -1.612799 0.084815
O  -0.201347 3.44247 0.244681
O  0.351096 1.915018 -1.800495
O  0.848705 2.061764 1.664377
C  0.258534 1.27419 -0.558284
C  1.42851 0.306769 -0.497218
C  -1.089948 0.574742 -0.382068
C  0.366498 2.294043 0.592989
C  -0.353358 4.479862 1.238782
C  2.720413 0.817459 -0.594015
C  -1.519388 0.123795 0.863827
C  1.265136 -1.066462 -0.415914
C  -1.900676 0.346161 -1.486194
C  3.822711 -0.016323 -0.591972
C  -2.734707 -0.524239 1.008244
C  2.360854 -1.919924 -0.417784
C  -3.119812 -0.303172 -1.356031
C  -0.45136 5.787095 0.480929
C  -1.582065 4.197006 2.081734
C  3.63435 -1.388798 -0.503013
C  -3.533587 -0.731785 -0.106016
H  0.536363 4.485042 1.872426
H  2.880577 1.884858 -0.675051
H  -0.898995 0.258146 1.740231
H  0.276968 -1.500531 -0.355947
H  -1.577816 0.661011 -2.468737
H  -0.219934 2.690947 -1.791656
H  4.817408 0.40172 -0.661167
H  -3.04843 -0.866428 1.984844
H  2.209134 -2.98861 -0.356441
H  -3.734161 -0.473114 -2.229777
H  -0.541742 6.61355 1.184979
H  0.435144 5.965157 -0.127245
H  -1.326867 5.807535 -0.169089
H  -1.714923 4.990211 2.817764
H  -1.492259 3.257717 2.625476
H  -2.480726 4.156824 1.465091
totalener: -6031.64298530 hartree
nucrepener: 2555.37362171 hartree
electener: -8587.01660701 hartree
twoeener: 4865.58030080 hartree
kineticenergy: 6020.59971617 hartree
xcener: -225.571485148430 hartree
chargesum: 0.0000000
charge: -0.031621 -0.024396 -0.300922 -0.331325 -0.327361 0.734586 -0.042112 -0.168024 0.244296 0.121518 -0.200413 -0.279433 -0.108096 -0.190583 -0.094303 -0.061433 -0.121589 -0.095713 -0.235155 -0.250301 -0.019339 -0.038135 0.071363 0.106201 0.151978 0.130468 0.131673 0.180946 0.123171 0.128847 0.123520 0.127251 0.085209 0.095737 0.083367 0.090109 0.102354 0.087659
qa: -0.0316 -0.0244 -0.3009 -0.3313 -0.3274 0.7346 -0.0421 -0.1680 0.2443 0.1215 -0.2004 -0.2794 -0.1081 -0.1906 -0.0943 -0.0614 -0.1216 -0.0957 -0.2352 -0.2503 -0.0193 -0.0381 0.0714 0.1062 0.1520 0.1305 0.1317 0.1809 0.1232 0.1288 0.1235 0.1273 0.0852 0.0957 0.0834 0.0901 0.1024 0.0877
va: 1.2278 1.2333 2.1321 2.1086 2.1605 3.4481 3.7553 3.6912 4.3199 3.8676 4.1394 4.0261 3.9109 4.0423 3.8961 3.8814 3.9764 3.9137 3.9307 3.9061 4.0390 4.0600 1.0199 1.0222 1.0180 1.0039 1.0370 1.0624 1.0058 1.0054 1.0077 1.0073 1.0091 1.0094 1.0080 1.0096 1.0144 1.0091
dispcorr: -0.020536247 hartree
energy: -6031.663521551739
dipole: -4.94823 4.19574 -0.75250 71.75948 -70.19251 1.56698 8.15572 -8.11701 0.03871
magnitude: 1.73872 au
magnitude: 4.41949 debye
