program: Orca
programVersion: 5.0.2
elementType: Br Br O O O C C C C C C C C C C C C C C C C C H H H H H H H H H H H H H H H H
charge: 0
multiplicity: 1
keywords: wb97x-d3
keywords: def2-TZVPP
keywords: def2/J RIJCOSX
keywords: DEFGRID2
keywords: scfconv7
keywords: smallprint printgap noloewdin
keywords: NOSOSCF
formula: C17H16Br2O3
InChI: InChI=1/C17H16Br2O3/c1-11(2)22-16(20)17(21,12-3-7-14(18)8-4-12)13-5-9-15(19)10-6-13/h3-11,21H,1-2H3
38 atoms
Br 5.024472 -2.516175 -0.330158
Br -5.175457 -1.643365 0.161658
O  -0.055679 3.573745 0.337653
O  0.23086 2.005707 -1.708335
O  0.862304 2.099624 1.753312
C  0.209089 1.365818 -0.4644
C  1.376815 0.390872 -0.441792
C  -1.126224 0.644945 -0.258446
C  0.402769 2.377849 0.682667
C  -0.048213 4.633241 1.319793
C  2.496741 0.629411 -1.230199
C  -1.743093 0.077764 -1.370277
C  1.370171 -0.725169 0.384659
C  -1.742448 0.505737 0.980137
C  3.585007 -0.228829 -1.199449
C  -2.941721 -0.605589 -1.2544
C  2.450115 -1.591465 0.425728
C  -2.945624 -0.172822 1.110136
C  0.010918 5.933493 0.544782
C  -1.283165 4.524182 2.194248
C  3.555665 -1.337521 -0.369775
C  -3.542087 -0.724888 -0.009633
H  0.848808 4.529175 1.934674
H  2.533218 1.488634 -1.884468
H  -1.280538 0.161105 -2.344309
H  0.512074 -0.943817 1.005236
H  -1.291486 0.909557 1.876359
H  -0.391308 2.739812 -1.689789
H  4.444901 -0.027709 -1.823832
H  -3.398981 -1.041066 -2.132349
H  2.420726 -2.456593 1.07389
H  -3.405297 -0.265624 2.084541
H  0.048663 6.773354 1.238169
H  0.899454 5.982475 -0.084301
H  -0.868686 6.063652 -0.087514
H  -1.298023 3.592754 2.75912
H  -2.194724 4.585536 1.598093
H  -1.298008 5.342711 2.914443
totalener: -6031.64359146 hartree
nucrepener: 2551.34828225 hartree
electener: -8582.99187371 hartree
twoeener: 4861.66631909 hartree
kineticenergy: 6020.59064859 hartree
xcener: -225.570522669967 hartree
chargesum: -0.0000000
charge: -0.033500 -0.023699 -0.290140 -0.339779 -0.334094 0.576006 0.000501 -0.072510 0.266876 0.126088 -0.190787 -0.209047 -0.149114 -0.225471 -0.097493 -0.096387 -0.107532 -0.096301 -0.233267 -0.251526 -0.024652 -0.024433 0.071717 0.125054 0.131676 0.128705 0.150213 0.183129 0.123680 0.126982 0.122453 0.127150 0.084503 0.097441 0.081981 0.097651 0.087161 0.090766
qa: -0.0335 -0.0237 -0.2901 -0.3398 -0.3341 0.5760 0.0005 -0.0725 0.2669 0.1261 -0.1908 -0.2090 -0.1491 -0.2255 -0.0975 -0.0964 -0.1075 -0.0963 -0.2333 -0.2515 -0.0247 -0.0244 0.0717 0.1251 0.1317 0.1287 0.1502 0.1831 0.1237 0.1270 0.1225 0.1271 0.0845 0.0974 0.0820 0.0977 0.0872 0.0908
va: 1.2264 1.2343 2.1401 2.0672 2.1570 3.6340 3.7513 3.7649 4.3327 3.8558 4.0775 4.0713 4.0468 3.9324 3.8999 3.8973 3.9503 3.9518 3.9332 3.9069 4.0354 4.0576 1.0211 1.0352 1.0298 0.9994 1.0152 1.0594 1.0064 1.0058 1.0070 1.0067 1.0084 1.0093 1.0085 1.0154 1.0093 1.0102
dispcorr: -0.020315690 hartree
energy: -6031.663907145856
dipole: -2.05722 1.34768 -0.70954 73.99234 -72.33901 1.65333 7.70606 -7.70864 -0.00258
magnitude: 1.79915 au
magnitude: 4.57308 debye
