program: Orca
programVersion: 5.0.2
elementType: F F F O O O N N C C C C C C C C C C C C C C C C H H H H H H H H H H H H H H H
charge: 0
multiplicity: 1
keywords: wb97x-d3
keywords: def2-TZVPP
keywords: def2/J RIJCOSX
keywords: DEFGRID2
keywords: scfconv7
keywords: smallprint printgap noloewdin
keywords: NOSOSCF
formula: C16H15F3N2O3
InChI: InChI=1/C16H15F3N2O3/c17-16(18,19)12-4-2-11(3-5-12)9-24-14-13(8-20-10-21-14)15-22-6-1-7-23-15/h2-5,8,10,15H,1,6-7,9H2
39 atoms
F  -4.449985 0.646673 -1.973896
F  -5.092085 1.862342 -0.324574
F  -5.600906 -0.225345 -0.381296
O  2.545543 1.291109 -0.817585
O  4.154044 0.419098 0.609666
O  1.45417 -0.360472 1.369293
N  0.99566 -2.409996 0.456863
N  2.194681 -3.189612 -1.426007
C  3.449312 0.245222 -0.587447
C  4.005896 2.815171 0.351095
C  3.198344 2.55362 -0.904871
C  4.911761 1.625305 0.603137
C  2.676298 -1.034168 -0.51275
C  1.685341 -1.287827 0.448367
C  2.875958 -2.041105 -1.427773
C  0.29505 -0.472509 2.189205
C  -0.971564 -0.198518 1.427374
C  -2.1696 -0.746309 1.869661
C  -0.982585 0.629404 0.309072
C  -3.35667 0.330346 0.082531
C  -3.359286 -0.48103 1.209417
C  -2.163911 0.887658 -0.363481
C  1.287431 -3.30497 -0.477994
C  -4.622846 0.645943 -0.64535
H  4.164826 0.194745 -1.427489
H  4.602896 3.720637 0.2292
H  3.339621 2.970071 1.203288
H  3.851082 2.573227 -1.78745
H  2.418211 3.299999 -1.050001
H  5.408036 1.690137 1.570913
H  5.689227 1.570951 -0.170527
H  0.436536 0.283677 2.962099
H  0.249773 -1.443636 2.683491
H  3.619613 -1.917396 -2.207248
H  -2.177548 -1.396794 2.735499
H  -0.069866 1.07774 -0.058388
H  -4.27371 -0.924888 1.578592
H  -2.138829 1.528226 -1.235396
H  0.715342 -4.224387 -0.451973
elementType: F O N C H
totalener: -1253.59975934 hartree
nucrepener: 2111.65151590 hartree
electener: -3365.25127524 hartree
oneelecener: -5915.52724977 hartree
twoeener: 2550.27597453 hartree
cpcmener: -0.03468245 hartree
kineticenergy: 1248.71641523 hartree
xcener: -113.867413288463 hartree
chargesum: -0.0000000
charge: -0.185916 -0.185690 -0.182999 -0.362450 -0.372575 -0.294244 -0.396563 -0.389867 0.297288 -0.099347 0.007678 0.005299 -0.126315 0.332235 0.081577 0.122557 -0.002637 -0.189794 -0.179815 -0.050941 -0.136986 -0.171010 0.179499 0.558018 0.100451 0.075853 0.069064 0.092327 0.099429 0.102838 0.089363 0.124437 0.113851 0.132021 0.146542 0.154525 0.152370 0.150221 0.139708
qa: -0.1859 -0.1857 -0.1830 -0.3625 -0.3726 -0.2942 -0.3966 -0.3899 0.2973 -0.0993 0.0077 0.0053 -0.1263 0.3322 0.0816 0.1226 -0.0026 -0.1898 -0.1798 -0.0509 -0.1370 -0.1710 0.1795 0.5580 0.1005 0.0759 0.0691 0.0923 0.0994 0.1028 0.0894 0.1244 0.1139 0.1320 0.1465 0.1545 0.1524 0.1502 0.1397
va: 1.1114 1.1007 1.1183 1.9556 1.9465 2.1212 2.9535 3.0197 4.0719 3.8441 3.8958 3.9202 3.7024 4.0645 4.0307 3.7463 3.6532 4.0053 3.9220 3.6530 3.9523 4.0441 4.0737 4.4250 1.0051 1.0236 1.0202 1.0066 0.9968 0.9956 1.0036 0.9906 1.0170 1.0181 0.9994 1.0253 1.0067 1.0110 0.9932
dispcorr: -0.018026632 hartree
energy: -1253.617785970527
dipole: 38.58416 -36.63663 1.94753 6.39846 -4.96998 1.42848 6.73355 -5.96158 0.77197
magnitude: 2.53562 au
magnitude: 6.44503 debye
