program: Orca
programVersion: 5.0.2
elementType: F F F O O O N N C C C C C C C C C C C C C C C C H H H H H H H H H H H H H H H
charge: 0
multiplicity: 1
keywords: wb97x-d3
keywords: def2-TZVPP
keywords: def2/J RIJCOSX
keywords: DEFGRID2
keywords: scfconv7
keywords: smallprint printgap noloewdin
keywords: NOSOSCF
formula: C16H15F3N2O3
InChI: InChI=1/C16H15F3N2O3/c17-16(18,19)12-4-2-11(3-5-12)9-24-14-13(8-20-10-21-14)15-22-6-1-7-23-15/h2-5,8,10,15H,1,6-7,9H2
39 atoms
F  -4.711038 0.114548 1.815353
F  -5.752567 0.32508 -0.053701
F  -4.747337 2.014279 0.817099
O  4.18314 0.231691 -0.74347
O  2.635448 1.453259 0.479614
O  1.419173 -0.530383 -1.303938
N  0.92173 -2.370313 -0.033296
N  2.114902 -2.816614 1.959029
C  3.483314 0.33779 0.465024
C  4.1818 2.637796 -0.948339
C  5.011699 1.367601 -0.968122
C  3.362485 2.66834 0.328537
C  2.654687 -0.893154 0.65056
C  1.640943 -1.285713 -0.236203
C  2.833361 -1.71303 1.739805
C  0.256527 -0.764432 -2.091481
C  -1.008997 -0.383319 -1.373895
C  -2.194723 -1.038216 -1.682899
C  -1.029767 0.640195 -0.430801
C  -3.394169 0.333002 -0.119819
C  -3.38461 -0.683072 -1.066719
C  -2.211423 0.991498 0.198516
C  1.198644 -3.082833 1.051176
C  -4.650032 0.695595 0.605853
H  4.205665 0.422072 1.296135
H  4.835269 3.510539 -0.992354
H  3.523754 2.671945 -1.819654
H  5.793417 1.413674 -0.198508
H  5.499558 1.217043 -1.930583
H  2.629944 3.474716 0.321469
H  4.017899 2.816776 1.196669
H  0.212772 -1.798646 -2.43541
H  0.393844 -0.131225 -2.968431
H  3.589435 -1.469767 2.47796
H  -2.192716 -1.84035 -2.410692
H  -0.123117 1.17081 -0.171495
H  -4.289941 -1.214293 -1.327384
H  -2.197183 1.785099 0.934214
H  0.601915 -3.974257 1.20087
elementType: F O N C H
totalener: -1253.59989489 hartree
nucrepener: 2109.45537182 hartree
electener: -3363.05526671 hartree
oneelecener: -5911.16864187 hartree
twoeener: 2548.11337516 hartree
cpcmener: -0.03518190 hartree
kineticenergy: 1248.71228401 hartree
xcener: -113.866390670490 hartree
chargesum: 0.0000000
charge: -0.185671 -0.183637 -0.185588 -0.372194 -0.363606 -0.292101 -0.395867 -0.389886 0.300212 -0.098911 0.004819 0.006548 -0.127744 0.332618 0.080414 0.122046 0.009054 -0.194791 -0.190540 -0.051061 -0.137369 -0.164188 0.179151 0.556971 0.100395 0.076172 0.069200 0.088974 0.103235 0.099988 0.091236 0.114581 0.123070 0.132274 0.146538 0.151981 0.154012 0.150227 0.139438
qa: -0.1857 -0.1836 -0.1856 -0.3722 -0.3636 -0.2921 -0.3959 -0.3899 0.3002 -0.0989 0.0048 0.0065 -0.1277 0.3326 0.0804 0.1220 0.0091 -0.1948 -0.1905 -0.0511 -0.1374 -0.1642 0.1792 0.5570 0.1004 0.0762 0.0692 0.0890 0.1032 0.1000 0.0912 0.1146 0.1231 0.1323 0.1465 0.1520 0.1540 0.1502 0.1394
va: 1.1000 1.1173 1.1125 1.9483 1.9534 2.1208 2.9549 3.0202 4.0675 3.8413 3.9198 3.8993 3.7070 4.0627 4.0305 3.7497 3.6398 4.0076 3.9424 3.6576 3.9572 4.0357 4.0726 4.4262 1.0049 1.0234 1.0202 1.0039 0.9955 0.9967 1.0065 1.0151 0.9915 1.0181 0.9999 1.0254 1.0063 1.0105 0.9932
dispcorr: -0.017941243 hartree
energy: -1253.617836135594
dipole: 39.32306 -37.29787 2.02519 5.32140 -4.04450 1.27690 -8.72067 7.63683 -1.08385
magnitude: 2.62804 au
magnitude: 6.67994 debye
