program: Orca
programVersion: 5.0.2
elementType: F F F O O O N N C C C C C C C C C C C C C C C C H H H H H H H H H H H H H H H
charge: 0
multiplicity: 1
keywords: wb97x-d3
keywords: def2-TZVPP
keywords: def2/J RIJCOSX
keywords: DEFGRID2
keywords: scfconv7
keywords: smallprint printgap noloewdin
keywords: NOSOSCF
formula: C16H15F3N2O3
InChI: InChI=1/C16H15F3N2O3/c17-16(18,19)12-4-2-11(3-5-12)9-24-14-13(8-20-10-21-14)15-22-6-1-7-23-15/h2-5,8,10,15H,1,6-7,9H2
39 atoms
F  -5.767529 0.40261 0.057009
F  -4.804031 -0.73373 -1.491544
F  -4.784189 1.413231 -1.56603
O  2.700042 1.205287 -1.012344
O  4.236728 0.429159 0.543611
O  1.432554 0.051186 1.342744
N  0.881209 -2.119246 0.862284
N  2.035202 -3.31145 -0.822686
C  3.507149 0.131386 -0.614897
C  4.327284 2.749417 -0.116115
C  3.4751 2.362977 -1.310294
C  5.11185 1.534045 0.340417
C  2.635162 -1.050969 -0.335291
C  1.625205 -1.055867 0.638202
C  2.780039 -2.224222 -1.037407
C  0.291893 0.142951 2.190879
C  -0.994675 0.217959 1.417641
C  -2.157783 -0.300767 1.973912
C  -1.056552 0.82504 0.167174
C  -3.412541 0.367652 0.040696
C  -3.362831 -0.226623 1.29561
C  -2.25602 0.893188 -0.52234
C  1.126784 -3.19379 0.123951
C  -4.689746 0.369693 -0.734451
H  4.207643 -0.11652 -1.431717
H  5.012322 3.552791 -0.392533
H  3.696162 3.118468 0.695918
H  4.112009 2.167111 -2.182848
H  2.773032 3.151011 -1.580178
H  5.620519 1.71149 1.287508
H  5.872901 1.271485 -0.406125
H  0.447136 1.064855 2.751899
H  0.266972 -0.679099 2.907516
H  3.532227 -2.294803 -1.815397
H  -2.123314 -0.779262 2.944685
H  -0.168363 1.241727 -0.290038
H  -4.249198 -0.647405 1.751097
H  -2.272196 1.358977 -1.498672
H  0.510621 -4.061384 0.326707
elementType: F O N C H
totalener: -1253.59994033 hartree
nucrepener: 2107.74962499 hartree
electener: -3361.34956532 hartree
oneelecener: -5907.78785114 hartree
twoeener: 2546.43828582 hartree
cpcmener: -0.03535341 hartree
kineticenergy: 1248.71990568 hartree
xcener: -113.867748370519 hartree
chargesum: 0.0000000
charge: -0.184261 -0.185145 -0.184201 -0.365229 -0.371325 -0.290485 -0.396660 -0.389561 0.300278 -0.099781 0.006341 0.006039 -0.133429 0.337346 0.081199 0.126860 0.013558 -0.196814 -0.194139 -0.048881 -0.143430 -0.154650 0.178740 0.555638 0.100597 0.076100 0.069284 0.090364 0.101081 0.102937 0.088713 0.121616 0.113900 0.131856 0.146497 0.146360 0.151637 0.151906 0.139143
qa: -0.1843 -0.1851 -0.1842 -0.3652 -0.3713 -0.2905 -0.3967 -0.3896 0.3003 -0.0998 0.0063 0.0060 -0.1334 0.3373 0.0812 0.1269 0.0136 -0.1968 -0.1941 -0.0489 -0.1434 -0.1546 0.1787 0.5556 0.1006 0.0761 0.0693 0.0904 0.1011 0.1029 0.0887 0.1216 0.1139 0.1319 0.1465 0.1464 0.1516 0.1519 0.1391
va: 1.1156 1.0993 1.1157 1.9503 1.9492 2.1231 2.9557 3.0209 4.0700 3.8417 3.9005 3.9200 3.7106 4.0584 4.0306 3.7480 3.6330 4.0029 3.9533 3.6552 3.9740 4.0117 4.0727 4.4270 1.0047 1.0235 1.0203 1.0063 0.9963 0.9957 1.0040 0.9920 1.0150 1.0182 0.9998 1.0265 1.0077 1.0093 0.9932
dispcorr: -0.017875385 hartree
energy: -1253.617815712945
dipole: 40.12340 -38.01440 2.10900 8.42593 -6.82439 1.60154 5.57550 -5.06722 0.50828
magnitude: 2.69651 au
magnitude: 6.85399 debye
