program: Orca
programVersion: 5.0.2
elementType: F F F O O O N N C C C C C C C C C C C C C C C C H H H H H H H H H H H H H H H
charge: 0
multiplicity: 1
keywords: wb97x-d3
keywords: def2-TZVPP
keywords: def2/J RIJCOSX
keywords: DEFGRID2
keywords: scfconv7
keywords: smallprint printgap noloewdin
keywords: NOSOSCF
formula: C16H15F3N2O3
InChI: InChI=1/C16H15F3N2O3/c17-16(18,19)12-4-2-11(3-5-12)9-24-14-13(8-20-10-21-14)15-22-6-1-7-23-15/h2-5,8,10,15H,1,6-7,9H2
39 atoms
F  -5.33742 1.336893 -1.730014
F  -4.697926 2.775582 -0.269091
F  -6.010248 1.172593 0.307577
O  3.127013 0.727187 1.375105
O  4.226309 0.945051 -0.652033
O  0.838126 -1.154467 0.437057
N  1.940591 -3.128565 0.065504
N  4.225017 -3.125612 -0.537674
C  3.103194 0.434892 0.001992
C  4.29836 2.783355 0.909745
C  3.121263 2.132057 1.610404
C  4.295149 2.36336 -0.547005
C  3.0996 -1.058478 -0.131879
C  1.946104 -1.81286 0.127329
C  4.217257 -1.790966 -0.459404
C  -0.377333 -1.881679 0.629011
C  -1.526708 -0.953045 0.385708
C  -2.571295 -0.884078 1.296032
C  -1.600581 -0.205459 -0.788162
C  -3.762424 0.620911 -0.142701
C  -3.690185 -0.105044 1.036098
C  -2.708097 0.578599 -1.051442
C  3.081525 -3.71788 -0.266043
C  -4.952162 1.470712 -0.453139
H  2.195811 0.87257 -0.448051
H  4.225038 3.869657 0.984243
H  5.234103 2.482133 1.386222
H  2.178058 2.566146 1.253851
H  3.165071 2.270807 2.690181
H  5.203902 2.673211 -1.061068
H  3.442707 2.814322 -1.070541
H  -0.408126 -2.286966 1.642024
H  -0.430552 -2.719631 -0.066909
H  5.15587 -1.29835 -0.676246
H  -2.522441 -1.451037 2.217055
H  -0.798243 -0.243192 -1.514094
H  -4.492047 -0.081353 1.76115
H  -2.745044 1.143414 -1.974034
H  3.060725 -4.799424 -0.32137
elementType: F O N C H
totalener: -1253.60026776 hartree
nucrepener: 2039.50710171 hartree
electener: -3293.10736947 hartree
oneelecener: -5770.16843358 hartree
twoeener: 2477.06106411 hartree
cpcmener: -0.03204003 hartree
kineticenergy: 1248.71467229 hartree
xcener: -113.865905149532 hartree
chargesum: 0.0000000
charge: -0.185968 -0.185331 -0.182699 -0.362575 -0.358548 -0.291622 -0.405824 -0.392795 0.257137 -0.101645 0.005518 0.001435 -0.106544 0.405979 0.040593 0.087605 -0.001205 -0.165469 -0.202521 -0.054241 -0.134777 -0.151268 0.177536 0.559659 0.102615 0.074944 0.070559 0.090944 0.104596 0.102126 0.089944 0.117890 0.118534 0.133468 0.149388 0.149837 0.153141 0.152418 0.137167
qa: -0.1860 -0.1853 -0.1827 -0.3626 -0.3585 -0.2916 -0.4058 -0.3928 0.2571 -0.1016 0.0055 0.0014 -0.1065 0.4060 0.0406 0.0876 -0.0012 -0.1655 -0.2025 -0.0542 -0.1348 -0.1513 0.1775 0.5597 0.1026 0.0749 0.0706 0.0909 0.1046 0.1021 0.0899 0.1179 0.1185 0.1335 0.1494 0.1498 0.1531 0.1524 0.1372
va: 1.1110 1.1025 1.1189 1.9271 1.9703 2.1324 2.9790 3.0200 4.0995 3.8316 3.9087 3.9137 3.6940 4.0092 4.0945 3.7768 3.7338 3.9671 3.9601 3.6657 3.9587 4.0022 4.0709 4.4236 1.0044 1.0247 1.0202 1.0042 0.9973 0.9951 1.0040 1.0045 1.0068 1.0305 1.0025 1.0060 1.0074 1.0082 0.9926
dispcorr: -0.016304816 hartree
energy: -1253.616572573775
dipole: 35.86520 -35.91460 -0.04940 0.44214 0.65353 1.09567 5.73535 -5.40077 0.33458
magnitude: 1.14668 au
magnitude: 2.91462 debye
