program: Orca
programVersion: 5.0.2
elementType: F F F O O O N N C C C C C C C C C C C C C C C C H H H H H H H H H H H H H H H
charge: 0
multiplicity: 1
keywords: wb97x-d3
keywords: def2-TZVPP
keywords: def2/J RIJCOSX
keywords: DEFGRID2
keywords: scfconv7
keywords: smallprint printgap noloewdin
keywords: NOSOSCF
formula: C16H15F3N2O3
InChI: InChI=1/C16H15F3N2O3/c17-16(18,19)12-4-2-11(3-5-12)9-24-14-13(8-20-10-21-14)15-22-6-1-7-23-15/h2-5,8,10,15H,1,6-7,9H2
39 atoms
F  -5.790084 1.148294 0.439152
F  -5.504236 1.633114 -1.636582
F  -4.605899 2.855278 -0.111589
O  4.246607 0.83821 1.181093
O  3.092198 0.814082 -0.823586
O  0.898248 -1.190624 -0.143066
N  2.008621 -3.180425 0.067959
N  4.288397 -3.214704 0.68964
C  3.118184 0.369161 0.506801
C  4.181043 2.856863 -0.143161
C  4.250664 2.261407 1.249699
C  3.015896 2.23468 -0.890065
C  3.146714 -1.128781 0.478094
C  2.005548 -1.864854 0.128511
C  4.267994 -1.878708 0.746653
C  -0.302944 -1.918454 -0.392539
C  -1.44369 -0.948456 -0.436917
C  -2.448006 -1.127942 -1.37965
C  -1.560625 0.08773 0.486165
C  -3.668717 0.727487 -0.475366
C  -3.560498 -0.302059 -1.399408
C  -2.664294 0.922807 0.467134
C  3.153166 -3.788424 0.351975
C  -4.886841 1.591359 -0.451231
H  2.213942 0.729921 1.027823
H  4.048622 3.938313 -0.078783
H  5.114741 2.671283 -0.67939
H  3.399177 2.602507 1.852542
H  5.163767 2.549569 1.769146
H  3.02368 2.50275 -1.9460
H  2.063651 2.575498 -0.463073
H  -0.469269 -2.650061 0.401599
H  -0.227338 -2.463419 -1.335344
H  5.198046 -1.401463 1.026209
H  -2.365587 -1.923433 -2.109436
H  -0.795066 0.251063 1.233475
H  -4.327216 -0.471663 -2.143016
H  -2.731658 1.720132 1.195682
H  3.143547 -4.870205 0.298249
elementType: F O N C H
totalener: -1253.60097792 hartree
nucrepener: 2043.00627997 hartree
electener: -3296.60725789 hartree
oneelecener: -5777.11796391 hartree
twoeener: 2480.51070602 hartree
cpcmener: -0.03249268 hartree
kineticenergy: 1248.71813344 hartree
xcener: -113.866931089220 hartree
chargesum: 0.0000000
charge: -0.185159 -0.183272 -0.184581 -0.358617 -0.361732 -0.290231 -0.408782 -0.392996 0.254581 -0.102682 0.000979 0.009598 -0.107001 0.400776 0.043521 0.116179 0.009247 -0.183041 -0.200730 -0.047140 -0.143665 -0.154533 0.176305 0.554024 0.107737 0.075056 0.070429 0.089993 0.102826 0.104820 0.088738 0.114278 0.112474 0.133599 0.146527 0.152312 0.151753 0.151284 0.137124
qa: -0.1852 -0.1833 -0.1846 -0.3586 -0.3617 -0.2902 -0.4088 -0.3930 0.2546 -0.1027 0.0010 0.0096 -0.1070 0.4008 0.0435 0.1162 0.0092 -0.1830 -0.2007 -0.0471 -0.1437 -0.1545 0.1763 0.5540 0.1077 0.0751 0.0704 0.0900 0.1028 0.1048 0.0887 0.1143 0.1125 0.1336 0.1465 0.1523 0.1518 0.1513 0.1371
va: 1.1004 1.1169 1.1140 1.9729 1.9243 2.1367 2.9693 3.0190 4.0933 3.8364 3.9134 3.9044 3.6873 4.0144 4.0905 3.7631 3.7198 3.9834 3.9638 3.6659 3.9779 4.0092 4.0723 4.4272 1.0022 1.0245 1.0197 1.0038 0.9949 0.9971 1.0048 1.0007 1.0065 1.0295 1.0031 1.0095 1.0088 1.0094 0.9928
dispcorr: -0.016403321 hartree
energy: -1253.617381242806
dipole: 35.29110 -35.36208 -0.07097 -0.10668 1.16396 1.05728 2.08812 -1.90755 0.18057
magnitude: 1.07494 au
magnitude: 2.73227 debye
