program: Orca
programVersion: 5.0.2
elementType: F F F O O O N N C C C C C C C C C C C C C C C C H H H H H H H H H H H H H H H
charge: 0
multiplicity: 1
keywords: wb97x-d3
keywords: def2-TZVPP
keywords: def2/J RIJCOSX
keywords: DEFGRID2
keywords: scfconv7
keywords: smallprint printgap noloewdin
keywords: NOSOSCF
formula: C16H15F3N2O3
InChI: InChI=1/C16H15F3N2O3/c17-16(18,19)12-4-2-11(3-5-12)9-24-14-13(8-20-10-21-14)15-22-6-1-7-23-15/h2-5,8,10,15H,1,6-7,9H2
39 atoms
F  -4.807062 1.982104 0.727716
F  -4.973678 0.045594 1.644543
F  -5.88414 0.405616 -0.265367
O  2.660354 1.483943 -0.120785
O  4.643902 0.496318 0.538821
O  1.241464 -0.788649 -1.435261
N  0.837859 -2.306896 0.235132
N  2.248601 -2.393952 2.129318
C  3.461728 0.332818 -0.184509
C  4.648207 2.846274 -0.023255
C  3.319509 2.600438 -0.712716
C  5.437853 1.550524 0.003148
C  2.678308 -0.803644 0.401733
C  1.556874 -1.322131 -0.260823
C  2.969188 -1.394572 1.610019
C  0.04279 -1.199719 -2.084674
C  -1.19319 -0.699972 -1.391275
C  -2.357852 -1.458012 -1.445164
C  -1.215653 0.525287 -0.733956
C  -3.540507 0.222991 -0.205193
C  -3.527176 -1.002065 -0.862585
C  -2.379982 0.982675 -0.135897
C  1.221242 -2.792205 1.408829
C  -4.796051 0.670373 0.470125
H  3.711677 0.123164 -1.239378
H  5.210819 3.612678 -0.559061
H  4.483206 3.208252 0.99422
H  3.474706 2.41452 -1.783673
H  2.647493 3.452367 -0.615269
H  6.32351 1.628898 0.632401
H  5.767349 1.285078 -1.009781
H  0.010997 -2.283991 -2.199864
H  0.112774 -0.763816 -3.081618
H  3.813862 -1.062724 2.199188
H  -2.35287 -2.419241 -1.943792
H  -0.323154 1.134754 -0.67161
H  -4.417205 -1.615346 -0.91727
H  -2.365055 1.93592 0.374891
H  0.624483 -3.603917 1.807146
elementType: F O N C H
totalener: -1253.60054562 hartree
nucrepener: 2087.62533860 hartree
electener: -3341.22588421 hartree
oneelecener: -5867.10614557 hartree
twoeener: 2525.88026136 hartree
cpcmener: -0.03185327 hartree
kineticenergy: 1248.70335755 hartree
xcener: -113.865965498789 hartree
chargesum: -0.0000000
charge: -0.183332 -0.185501 -0.186366 -0.355206 -0.354889 -0.297514 -0.396446 -0.391174 0.253541 -0.099308 0.003646 0.001867 -0.121140 0.388262 0.040444 0.124787 0.021169 -0.197190 -0.197845 -0.055586 -0.152056 -0.143154 0.175580 0.558958 0.104787 0.075925 0.070522 0.092880 0.103082 0.101936 0.090373 0.113116 0.122814 0.134723 0.147107 0.147620 0.152038 0.152930 0.138596
qa: -0.1833 -0.1855 -0.1864 -0.3552 -0.3549 -0.2975 -0.3964 -0.3912 0.2535 -0.0993 0.0036 0.0019 -0.1211 0.3883 0.0404 0.1248 0.0212 -0.1972 -0.1978 -0.0556 -0.1521 -0.1432 0.1756 0.5590 0.1048 0.0759 0.0705 0.0929 0.1031 0.1019 0.0904 0.1131 0.1228 0.1347 0.1471 0.1476 0.1520 0.1529 0.1386
va: 1.1182 1.1007 1.1112 1.9338 1.9709 2.1237 2.9587 3.0218 4.0928 3.8516 3.8978 3.9110 3.7194 3.9991 4.0921 3.7504 3.6211 3.9994 3.9615 3.6585 3.9925 3.9847 4.0752 4.4245 1.0052 1.0252 1.0200 1.0034 0.9971 0.9950 1.0040 1.0151 0.9905 1.0296 0.9994 1.0218 1.0077 1.0081 0.9933
dispcorr: -0.017607289 hartree
energy: -1253.618152906888
dipole: 40.21938 -38.42886 1.79051 4.50657 -3.66594 0.84063 -9.43861 7.05796 -2.38065
magnitude: 3.09517 au
magnitude: 7.86730 debye
