program: Orca
programVersion: 5.0.2
elementType: F F F O O O N N C C C C C C C C C C C C C C C C H H H H H H H H H H H H H H H
charge: 0
multiplicity: 1
keywords: wb97x-d3
keywords: def2-TZVPP
keywords: def2/J RIJCOSX
keywords: DEFGRID2
keywords: scfconv7
keywords: smallprint printgap noloewdin
keywords: NOSOSCF
formula: C16H15F3N2O3
InChI: InChI=1/C16H15F3N2O3/c17-16(18,19)12-4-2-11(3-5-12)9-24-14-13(8-20-10-21-14)15-22-6-1-7-23-15/h2-5,8,10,15H,1,6-7,9H2
39 atoms
F  -5.495572 1.579631 0.758051
F  -5.403358 1.665456 -1.38963
F  -4.136961 2.934541 -0.206372
O  4.071457 0.927889 1.077152
O  2.819157 0.808305 -0.861362
O  0.805046 -1.34045 -0.019975
N  2.058921 -3.244787 0.135984
N  4.367904 -3.115424 0.598785
C  2.947416 0.379903 0.465321
C  3.823035 2.916598 -0.267266
C  3.99881 2.347129 1.127726
C  2.654507 2.218228 -0.937579
C  3.078712 -1.113665 0.44548
C  1.970601 -1.932231 0.180797
C  4.263747 -1.784001 0.64548
C  -0.364175 -2.152571 -0.195561
C  -1.519829 -1.202082 -0.226468
C  -2.055777 -0.773578 -1.433521
C  -2.037485 -0.696725 0.961997
C  -3.593335 0.653223 -0.268596
C  -3.089406 0.149954 -1.460231
C  -3.068074 0.225693 0.946467
C  3.257035 -3.773393 0.346259
C  -4.659756 1.700997 -0.279723
H  2.047915 0.679414 1.032577
H  3.640135 3.991798 -0.212342
H  4.735143 2.767339 -0.851231
H  3.162321 2.652817 1.771533
H  4.919941 2.694257 1.596139
H  2.581884 2.472989 -1.995242
H  1.709683 2.510975 -0.458675
H  -0.457322 -2.859384 0.631001
H  -0.291234 -2.721048 -1.124559
H  5.176035 -1.240812 0.859485
H  -1.663757 -1.161183 -2.365604
H  -1.633503 -1.027372 1.911094
H  -3.486859 0.466586 -2.415179
H  -3.451404 0.60264 1.885545
H  3.318468 -4.854806 0.304458
elementType: F O N C H
totalener: -1253.60704641 hartree
nucrepener: 2054.70882049 hartree
electener: -3308.31586690 hartree
oneelecener: -5800.58754084 hartree
twoeener: 2492.27167393 hartree
cpcmener: -0.02741280 hartree
kineticenergy: 1248.73408647 hartree
xcener: -113.866521198731 hartree
chargesum: -0.0000000
charge: -0.183442 -0.182084 -0.182876 -0.343800 -0.344240 -0.276937 -0.408447 -0.385639 0.255414 -0.099900 -0.003877 0.002069 -0.119706 0.403252 0.043515 0.104476 -0.034198 -0.151027 -0.179038 -0.041719 -0.149567 -0.149939 0.172485 0.554895 0.095075 0.073424 0.069893 0.087059 0.100254 0.102274 0.087740 0.112404 0.112022 0.132008 0.145505 0.146579 0.150907 0.149839 0.135348
qa: -0.1834 -0.1821 -0.1829 -0.3438 -0.3442 -0.2769 -0.4084 -0.3856 0.2554 -0.0999 -0.0039 0.0021 -0.1197 0.4033 0.0435 0.1045 -0.0342 -0.1510 -0.1790 -0.0417 -0.1496 -0.1499 0.1725 0.5549 0.0951 0.0734 0.0699 0.0871 0.1003 0.1023 0.0877 0.1124 0.1120 0.1320 0.1455 0.1466 0.1509 0.1498 0.1353
va: 1.1159 1.1193 1.1038 1.9846 1.9461 2.1317 2.9588 3.0229 4.1056 3.8308 3.9236 3.9178 3.7039 4.0160 4.0897 3.7669 3.7553 3.9559 3.9585 3.6773 3.9819 3.9910 4.0772 4.4268 1.0067 1.0249 1.0199 1.0041 0.9951 0.9974 1.0044 1.0044 1.0050 1.0293 1.0025 1.0024 1.0085 1.0090 0.9923
dispcorr: -0.016299108 hartree
energy: -1253.623345521414
dipole: 32.62236 -32.93402 -0.31166 -1.27451 2.16329 0.88879 1.36096 -1.18023 0.18073
magnitude: 0.95903 au
magnitude: 2.43765 debye
