program: Orca
programVersion: 5.0.2
elementType: F F F O O O N N C C C C C C C C C C C C C C C C H H H H H H H H H H H H H H H
charge: 0
multiplicity: 1
keywords: wb97x-d3
keywords: def2-TZVPP
keywords: def2/J RIJCOSX
keywords: DEFGRID2
keywords: scfconv7
keywords: smallprint printgap noloewdin
keywords: NOSOSCF
formula: C16H15F3N2O3
InChI: InChI=1/C16H15F3N2O3/c17-16(18,19)12-4-2-11(3-5-12)9-24-14-13(8-20-10-21-14)15-22-6-1-7-23-15/h2-5,8,10,15H,1,6-7,9H2
39 atoms
F  -5.308139 1.322091 -1.795273
F  -4.739053 2.737359 -0.283456
F  -6.049016 1.10696 0.213371
O  3.16066 0.720897 1.371918
O  4.206234 0.961677 -0.676542
O  0.834749 -1.130514 0.470994
N  1.923662 -3.104754 0.076726
N  4.183307 -3.110187 -0.59787
C  3.099905 0.45242 -0.001445
C  4.348905 2.768233 0.915579
C  3.182829 2.11728 1.63708
C  4.29812 2.374265 -0.548924
C  3.083003 -1.039438 -0.153936
C  1.934233 -1.790139 0.136004
C  4.186706 -1.776708 -0.520502
C  -0.374159 -1.855044 0.697918
C  -1.532037 -0.945396 0.420748
C  -2.600783 -0.889026 1.304136
C  -1.589623 -0.203567 -0.757473
C  -3.778706 0.594703 -0.168202
C  -3.723611 -0.126619 1.014831
C  -2.702232 0.563049 -1.050578
C  3.049921 -3.701697 -0.28862
C  -4.969485 1.43411 -0.504016
H  2.182326 0.900852 -0.422453
H  4.294144 3.854277 1.013272
H  5.293511 2.443331 1.359194
H  2.235394 2.574869 1.321074
H  3.261087 2.231509 2.718492
H  5.196671 2.681528 -1.083621
H  3.43869 2.84971 -1.040878
H  -0.395217 -2.218458 1.72778
H  -0.424959 -2.725565 0.041626
H  5.119463 -1.285892 -0.769383
H  -2.567002 -1.450738 2.229526
H  -0.769309 -0.229964 -1.463917
H  -4.542654 -0.110678 1.721051
H  -2.724057 1.125077 -1.975643
H  3.026655 -4.784327 -0.333523
elementType: F O N C H
totalener: -1253.60606835 hartree
nucrepener: 2039.67656298 hartree
electener: -3293.28263133 hartree
oneelecener: -5770.40757691 hartree
twoeener: 2477.12494558 hartree
cpcmener: -0.02691357 hartree
kineticenergy: 1248.71774310 hartree
xcener: -113.866427308537 hartree
chargesum: 0.0000000
charge: -0.184632 -0.183884 -0.182199 -0.344601 -0.343973 -0.286197 -0.401280 -0.384600 0.254633 -0.102163 0.002726 -0.000809 -0.109450 0.400045 0.038206 0.078940 0.005855 -0.166672 -0.196959 -0.054305 -0.133443 -0.150056 0.174066 0.558283 0.094769 0.073439 0.070546 0.087891 0.102018 0.100021 0.086207 0.116493 0.118412 0.133125 0.145703 0.147225 0.151177 0.149746 0.135699
qa: -0.1846 -0.1839 -0.1822 -0.3446 -0.3440 -0.2862 -0.4013 -0.3846 0.2546 -0.1022 0.0027 -0.0008 -0.1094 0.4000 0.0382 0.0789 0.0059 -0.1667 -0.1970 -0.0543 -0.1334 -0.1501 0.1741 0.5583 0.0948 0.0734 0.0705 0.0879 0.1020 0.1000 0.0862 0.1165 0.1184 0.1331 0.1457 0.1472 0.1512 0.1497 0.1357
va: 1.1131 1.1039 1.1196 1.9453 1.9828 2.1365 2.9819 3.0250 4.1170 3.8311 3.9178 3.9211 3.7043 4.0139 4.0959 3.7864 3.7351 3.9750 3.9645 3.6762 3.9648 4.0075 4.0740 4.4248 1.0052 1.0249 1.0200 1.0041 0.9973 0.9953 1.0043 1.0036 1.0082 1.0300 1.0035 1.0069 1.0082 1.0093 0.9925
dispcorr: -0.016328355 hartree
energy: -1253.622396701421
dipole: 36.13490 -36.08416 0.05074 0.62964 0.42380 1.05344 6.25276 -5.82308 0.42968
magnitude: 1.13883 au
magnitude: 2.89467 debye
