program: Orca
programVersion: 5.0.2
elementType: F F F O O O N N C C C C C C C C C C C C C C C C H H H H H H H H H H H H H H H
charge: 0
multiplicity: 1
keywords: wb97x-d3
keywords: def2-TZVPP
keywords: def2/J RIJCOSX
keywords: DEFGRID2
keywords: scfconv7
keywords: smallprint printgap noloewdin
keywords: NOSOSCF
formula: C16H15F3N2O3
InChI: InChI=1/C16H15F3N2O3/c17-16(18,19)12-4-2-11(3-5-12)9-24-14-13(8-20-10-21-14)15-22-6-1-7-23-15/h2-5,8,10,15H,1,6-7,9H2
39 atoms
F  -5.344011 1.712428 -1.848359
F  -4.350234 2.967282 -0.41248
F  -5.759607 1.488284 0.248733
O  3.854317 0.846212 1.355922
O  3.556759 0.857881 -0.937133
O  0.777434 -1.26103 -0.079497
N  1.992376 -3.190676 0.063843
N  4.326934 -3.11911 0.393362
C  3.057275 0.413624 0.2929
C  4.397777 2.852716 0.128409
C  3.897594 2.264728 1.435035
C  3.579483 2.277541 -1.013103
C  3.081379 -1.085735 0.2757
C  1.939199 -1.873713 0.084534
C  4.259513 -1.787384 0.417115
C  -0.413398 -2.047622 -0.172885
C  -1.560053 -1.088268 -0.283671
C  -2.456464 -1.181526 -1.33863
C  -1.746317 -0.09224 0.673597
C  -3.668032 0.721405 -0.519139
C  -3.510689 -0.286458 -1.458545
C  -2.78866 0.808756 0.557741
C  3.183549 -3.7492 0.220101
C  -4.778988 1.717463 -0.637361
H  2.032817 0.797838 0.431697
H  4.303527 3.940439 0.146835
H  5.45557 2.61505 -0.010075
H  2.897263 2.654985 1.668398
H  4.552964 2.514655 2.269555
H  4.002761 2.534916 -1.984237
H  2.553922 2.670798 -0.982063
H  -0.514456 -2.675693 0.716055
H  -0.370735 -2.70449 -1.043679
H  5.19652 -1.261763 0.56252
H  -2.33051 -1.952733 -2.088273
H  -1.06986 -0.009766 1.515441
H  -4.185634 -0.38269 -2.297894
H  -2.903977 1.579219 1.30959
H  3.213484 -4.832465 0.198038
elementType: F O N C H
totalener: -1253.60627045 hartree
nucrepener: 2035.51799325 hartree
electener: -3289.12426370 hartree
oneelecener: -5762.01091814 hartree
twoeener: 2472.88665444 hartree
cpcmener: -0.02701980 hartree
kineticenergy: 1248.70590628 hartree
xcener: -113.861606723961 hartree
chargesum: -0.0000000
charge: -0.181758 -0.185106 -0.183728 -0.357728 -0.351867 -0.289978 -0.406559 -0.382087 0.254703 -0.106709 0.012468 0.001801 -0.109354 0.439022 0.010424 0.126185 -0.013357 -0.161904 -0.202005 -0.053493 -0.135386 -0.155026 0.174835 0.557932 0.101965 0.073813 0.070039 0.083654 0.101469 0.102064 0.085972 0.117728 0.104358 0.128874 0.145941 0.146478 0.151634 0.149205 0.135482
qa: -0.1818 -0.1851 -0.1837 -0.3577 -0.3519 -0.2900 -0.4066 -0.3821 0.2547 -0.1067 0.0125 0.0018 -0.1094 0.4390 0.0104 0.1262 -0.0134 -0.1619 -0.2020 -0.0535 -0.1354 -0.1550 0.1748 0.5579 0.1020 0.0738 0.0700 0.0837 0.1015 0.1021 0.0860 0.1177 0.1044 0.1289 0.1459 0.1465 0.1516 0.1492 0.1355
va: 1.1202 1.1120 1.1060 1.9645 1.9696 2.1409 2.9689 3.0269 4.1122 3.8445 3.9069 3.9246 3.6933 3.9506 4.1328 3.7503 3.7423 3.9634 3.9599 3.6863 3.9636 4.0094 4.0750 4.4257 1.0113 1.0239 1.0197 1.0063 0.9943 0.9966 1.0048 1.0003 1.0114 1.0300 1.0025 1.0085 1.0083 1.0087 0.9921
dispcorr: -0.016196458 hartree
energy: -1253.622466905943
dipole: 35.00616 -35.15485 -0.14869 -1.11978 2.01746 0.89768 3.66060 -3.53282 0.12778
magnitude: 0.91884 au
magnitude: 2.33551 debye
