program: Orca
programVersion: 5.0.2
elementType: F F F O O O N N C C C C C C C C C C C C C C C C H H H H H H H H H H H H H H H
charge: 0
multiplicity: 1
keywords: wb97x-d3
keywords: def2-TZVPP
keywords: def2/J RIJCOSX
keywords: DEFGRID2
keywords: scfconv7
keywords: smallprint printgap noloewdin
keywords: NOSOSCF
formula: C16H15F3N2O3
InChI: InChI=1/C16H15F3N2O3/c17-16(18,19)12-4-2-11(3-5-12)9-24-14-13(8-20-10-21-14)15-22-6-1-7-23-15/h2-5,8,10,15H,1,6-7,9H2
39 atoms
F  -6.205355 0.890095 -0.065434
F  -5.23368 1.830764 -1.737616
F  -4.939799 2.596267 0.249231
O  3.523462 0.699341 1.548993
O  3.983115 0.989761 -0.699965
O  0.753177 -1.191362 0.180048
N  1.947053 -3.125702 -0.060685
N  4.301587 -3.082565 -0.198591
C  3.101034 0.446228 0.238135
C  4.502389 2.784728 0.830885
C  3.582803 2.093892 1.821179
C  4.078036 2.402712 -0.57514
C  3.086626 -1.042218 0.055823
C  1.916972 -1.812731 0.056559
C  4.259607 -1.756055 -0.07288
C  -0.443732 -1.964051 0.151526
C  -1.612592 -1.032356 0.028933
C  -2.798966 -1.339562 0.683167
C  -1.568044 0.097397 -0.784293
C  -3.87531 0.570811 -0.291058
C  -3.927868 -0.549659 0.524994
C  -2.687599 0.895751 -0.939481
C  3.136228 -3.696012 -0.184394
C  -5.064522 1.463513 -0.459665
H  2.099275 0.882738 0.086742
H  4.445806 3.867748 0.958134
H  5.538261 2.48432 1.006012
H  2.574783 2.528371 1.770457
H  3.93876 2.199022 2.84629
H  4.79996 2.735803 -1.320991
H  3.110338 2.863531 -0.81698
H  -0.525061 -2.566798 1.059392
H  -0.428639 -2.65212 -0.698129
H  5.214339 -1.242781 -0.078898
H  -2.850803 -2.209481 1.326049
H  -0.662076 0.363806 -1.312336
H  -4.834108 -0.823101 1.047825
H  -2.622715 1.767248 -1.578136
H  3.144768 -4.775251 -0.282806
elementType: F O N C H
totalener: -1253.60591387 hartree
nucrepener: 2027.34216493 hartree
electener: -3280.94807879 hartree
oneelecener: -5745.59427361 hartree
twoeener: 2464.64619482 hartree
cpcmener: -0.02664275 hartree
kineticenergy: 1248.69968695 hartree
xcener: -113.862071095735 hartree
chargesum: -0.0000000
charge: -0.181774 -0.185110 -0.184032 -0.352308 -0.357883 -0.293162 -0.403522 -0.381791 0.251948 -0.106883 0.002440 0.012489 -0.107269 0.439227 0.008555 0.118057 0.014951 -0.182898 -0.195508 -0.052151 -0.139755 -0.158393 0.175082 0.556945 0.104025 0.074046 0.070216 0.086023 0.101936 0.100893 0.084034 0.113130 0.112409 0.128807 0.143411 0.146666 0.152497 0.149391 0.135257
qa: -0.1818 -0.1851 -0.1840 -0.3523 -0.3579 -0.2932 -0.4035 -0.3818 0.2519 -0.1069 0.0024 0.0125 -0.1073 0.4392 0.0086 0.1181 0.0150 -0.1829 -0.1955 -0.0522 -0.1398 -0.1584 0.1751 0.5569 0.1040 0.0740 0.0702 0.0860 0.1019 0.1009 0.0840 0.1131 0.1124 0.1288 0.1434 0.1467 0.1525 0.1494 0.1353
va: 1.1205 1.1124 1.1038 1.9698 1.9639 2.1450 2.9751 3.0276 4.1144 3.8453 3.9241 3.9069 3.7016 3.9405 4.1347 3.7695 3.7220 3.9929 3.9679 3.6818 3.9654 4.0263 4.0747 4.4276 1.0108 1.0239 1.0199 1.0047 0.9967 0.9945 1.0062 1.0060 1.0017 1.0303 1.0049 1.0103 1.0076 1.0100 0.9923
dispcorr: -0.016189354 hartree
energy: -1253.622103220928
dipole: 36.85935 -36.82400 0.03535 0.19425 0.74489 0.93914 5.20530 -4.91207 0.29322
magnitude: 0.98449 au
magnitude: 2.50237 debye
