program: Orca
programVersion: 5.0.2
elementType: F F F O O O N N C C C C C C C C C C C C C C C C H H H H H H H H H H H H H H H
charge: 0
multiplicity: 1
keywords: wb97x-d3
keywords: def2-TZVPP
keywords: def2/J RIJCOSX
keywords: DEFGRID2
keywords: scfconv7
keywords: smallprint printgap noloewdin
keywords: NOSOSCF
formula: C16H15F3N2O3
InChI: InChI=1/C16H15F3N2O3/c17-16(18,19)12-4-2-11(3-5-12)9-24-14-13(8-20-10-21-14)15-22-6-1-7-23-15/h2-5,8,10,15H,1,6-7,9H2
39 atoms
F  -5.069257 2.520434 0.37944
F  -6.210441 0.7164 0.114028
F  -5.415616 1.741907 -1.59484
O  3.808083 1.013043 1.270381
O  3.812173 0.754068 -1.028377
O  0.776057 -1.158175 0.010165
N  1.946454 -3.089188 0.357074
N  4.282063 -3.047963 0.682815
C  3.133938 0.483423 0.165619
C  4.631139 2.822251 -0.099629
C  3.929885 2.426992 1.186776
C  3.928514 2.15119 -1.264388
C  3.092277 -1.006805 0.327285
C  1.92668 -1.776439 0.233102
C  4.249995 -1.721743 0.553996
C  -0.415303 -1.936897 -0.044457
C  -1.594223 -1.014762 -0.138425
C  -2.71687 -1.437057 -0.845652
C  -1.636287 0.212916 0.511662
C  -3.892113 0.568627 -0.245164
C  -3.858935 -0.659347 -0.898263
C  -2.77648 1.002883 0.45624
C  3.120624 -3.660816 0.576043
C  -5.139233 1.390575 -0.330182
H  2.121549 0.917765 0.11584
H  4.608616 3.90723 -0.22113
H  5.679463 2.514901 -0.066368
H  2.934574 2.890123 1.234577
H  4.487229 2.746918 2.067485
H  4.483674 2.26764 -2.195505
H  2.9319 2.589773 -1.412645
H  -0.501678 -2.556483 0.852723
H  -0.388388 -2.610259 -0.904593
H  5.201505 -1.208657 0.637975
H  -2.700385 -2.387998 -1.363662
H  -0.785783 0.572809 1.07528
H  -4.713936 -1.019288 -1.45647
H  -2.77408 1.953547 0.971677
H  3.119786 -4.739838 0.678033
elementType: F O N C H
totalener: -1253.60596136 hartree
nucrepener: 2024.10929398 hartree
electener: -3277.71525534 hartree
oneelecener: -5739.10201255 hartree
twoeener: 2461.38675721 hartree
cpcmener: -0.02678789 hartree
kineticenergy: 1248.70055132 hartree
xcener: -113.862474656937 hartree
chargesum: 0.0000000
charge: -0.181708 -0.185786 -0.185154 -0.359241 -0.355331 -0.294522 -0.403836 -0.380958 0.256991 -0.107784 0.010517 0.003899 -0.105142 0.447313 -0.003583 0.129413 0.020894 -0.185696 -0.193224 -0.058056 -0.170419 -0.134655 0.174626 0.561184 0.104854 0.074200 0.070071 0.083718 0.101830 0.101888 0.085698 0.111359 0.110598 0.129111 0.142810 0.146641 0.150367 0.151910 0.135202
qa: -0.1817 -0.1858 -0.1852 -0.3592 -0.3553 -0.2945 -0.4038 -0.3810 0.2570 -0.1078 0.0105 0.0039 -0.1051 0.4473 -0.0036 0.1294 0.0209 -0.1857 -0.1932 -0.0581 -0.1704 -0.1347 0.1746 0.5612 0.1049 0.0742 0.0701 0.0837 0.1018 0.1019 0.0857 0.1114 0.1106 0.1291 0.1428 0.1466 0.1504 0.1519 0.1352
va: 1.1217 1.1090 1.1075 1.9632 1.9712 2.1472 2.9722 3.0275 4.1117 3.8487 3.9105 3.9212 3.6887 3.9215 4.1432 3.7626 3.7106 3.9847 3.9788 3.6874 4.0265 3.9631 4.0755 4.4278 1.0124 1.0239 1.0200 1.0060 0.9946 0.9961 1.0049 1.0006 1.0061 1.0296 1.0040 1.0110 1.0087 1.0083 0.9922
dispcorr: -0.016174260 hartree
energy: -1253.622135615947
dipole: 37.86047 -37.71652 0.14394 0.89396 0.11361 1.00757 1.06145 -1.20878 -0.14732
magnitude: 1.02840 au
magnitude: 2.61399 debye
