program: Orca
programVersion: 5.0.2
elementType: F F F O O O N N C C C C C C C C C C C C C C C C H H H H H H H H H H H H H H H
charge: 0
multiplicity: 1
keywords: wb97x-d3
keywords: def2-TZVPP
keywords: def2/J RIJCOSX
keywords: DEFGRID2
keywords: scfconv7
keywords: smallprint printgap noloewdin
keywords: NOSOSCF
formula: C16H15F3N2O3
InChI: InChI=1/C16H15F3N2O3/c17-16(18,19)12-4-2-11(3-5-12)9-24-14-13(8-20-10-21-14)15-22-6-1-7-23-15/h2-5,8,10,15H,1,6-7,9H2
39 atoms
F  -5.663488 1.46603 -0.739927
F  -4.396653 2.859678 0.30015
F  -5.186323 1.151402 1.333885
O  3.262501 0.805962 -0.813544
O  2.38559 0.663889 1.328416
O  1.110394 -1.148823 -0.630215
N  2.0780 -3.205414 -0.400403
N  4.216032 -3.433339 0.571073
C  3.378798 0.221676 0.449103
C  2.324507 2.790814 0.185495
C  3.36854 2.221843 -0.756913
C  2.428451 2.072388 1.518015
C  3.258804 -1.261945 0.294439
C  2.132934 -1.897763 -0.255818
C  4.268535 -2.105474 0.694479
C  -0.10503 -1.765961 -1.034628
C  -1.240668 -0.819313 -0.776174
C  -1.188376 0.150171 0.22163
C  -2.415804 -0.972424 -1.502683
C  -3.475521 0.754735 -0.217936
C  -2.296873 0.932084 0.497888
C  -3.53168 -0.199119 -1.224983
C  3.120097 -3.909935 0.020805
C  -4.678767 1.557346 0.158652
H  4.370296 0.464787 0.873901
H  2.487792 3.861292 0.323956
H  1.325051 2.660298 -0.23737
H  4.37609 2.508845 -0.425193
H  3.238969 2.588216 -1.775336
H  1.601612 2.325777 2.181699
H  3.361803 2.350804 2.027279
H  -0.271744 -2.689306 -0.474923
H  -0.051801 -2.034048 -2.092863
H  5.167707 -1.693542 1.141193
H  -0.287667 0.301471 0.800233
H  -2.470313 -1.712416 -2.292299
H  -2.22899 1.674629 1.283255
H  -4.432327 -0.352912 -1.803578
H  3.054376 -4.984637 -0.10392
elementType: F O N C H
totalener: -1253.60508613 hartree
nucrepener: 2089.91878876 hartree
electener: -3343.52387489 hartree
oneelecener: -5871.37581405 hartree
twoeener: 2527.85193916 hartree
cpcmener: -0.02818204 hartree
kineticenergy: 1248.71538500 hartree
xcener: -113.866691511684 hartree
chargesum: -0.0000000
charge: -0.182176 -0.185760 -0.184634 -0.354309 -0.357524 -0.274174 -0.402063 -0.384697 0.300528 -0.108562 0.007976 -0.001606 -0.148542 0.365604 0.080951 0.080254 0.027694 -0.192374 -0.189843 -0.053196 -0.167981 -0.133392 0.177800 0.558522 0.093605 0.077449 0.070118 0.084927 0.100990 0.104048 0.096501 0.111790 0.118000 0.126251 0.160438 0.142105 0.147229 0.151983 0.136069
qa: -0.1822 -0.1858 -0.1846 -0.3543 -0.3575 -0.2742 -0.4021 -0.3847 0.3005 -0.1086 0.0080 -0.0016 -0.1485 0.3656 0.0810 0.0803 0.0277 -0.1924 -0.1898 -0.0532 -0.1680 -0.1334 0.1778 0.5585 0.0936 0.0774 0.0701 0.0849 0.1010 0.1040 0.0965 0.1118 0.1180 0.1263 0.1604 0.1421 0.1472 0.1520 0.1361
va: 1.1202 1.1116 1.1038 1.9662 1.9576 2.1526 2.9806 3.0238 4.0730 3.8579 3.9195 3.8848 3.7505 4.0549 4.0292 3.8163 3.7193 3.9249 4.0006 3.6758 4.0574 3.9499 4.0710 4.4278 1.0060 1.0245 1.0169 1.0046 0.9958 0.9966 1.0076 1.0071 0.9969 1.0190 1.0169 1.0038 1.0125 1.0074 0.9927
dispcorr: -0.017709400 hartree
energy: -1253.622795527698
dipole: 32.63690 -31.68179 0.95511 0.01312 0.94449 0.95761 -1.24062 1.04594 -0.19468
magnitude: 1.36644 au
magnitude: 3.47321 debye
