program: Orca
programVersion: 5.0.2
elementType: F F F O O O N N C C C C C C C C C C C C C C C C H H H H H H H H H H H H H H H
charge: 0
multiplicity: 1
keywords: wb97x-d3
keywords: def2-TZVPP
keywords: def2/J RIJCOSX
keywords: DEFGRID2
keywords: scfconv7
keywords: smallprint printgap noloewdin
keywords: NOSOSCF
formula: C16H15F3N2O3
InChI: InChI=1/C16H15F3N2O3/c17-16(18,19)12-4-2-11(3-5-12)9-24-14-13(8-20-10-21-14)15-22-6-1-7-23-15/h2-5,8,10,15H,1,6-7,9H2
39 atoms
F  -4.32104 2.956345 -0.260256
F  -5.622924 1.54689 0.71535
F  -5.195571 1.350433 -1.383896
O  2.49665 0.798226 -1.040269
O  3.202211 0.696796 1.169094
O  1.058098 -1.222243 0.495513
N  2.074549 -3.238654 0.157223
N  4.328847 -3.357699 -0.532445
C  3.422525 0.262083 -0.140182
C  2.305296 2.773915 0.336849
C  2.528695 2.219765 -1.058288
C  3.287301 2.110564 1.283677
C  3.307096 -1.229963 -0.161812
C  2.129639 -1.92307 0.168765
C  4.376149 -2.024017 -0.50625
C  -0.17987 -1.889081 0.705553
C  -1.292413 -0.897266 0.530996
C  -2.494665 -1.112061 1.194301
C  -1.187015 0.18664 -0.336165
C  -3.473338 0.789819 0.107203
C  -3.583799 -0.281978 0.982386
C  -2.268611 1.024931 -0.545901
C  3.174694 -3.891669 -0.194333
C  -4.650711 1.659475 -0.195984
H  4.441366 0.553691 -0.454389
H  2.453841 3.855173 0.338614
H  1.279976 2.579955 0.661101
H  3.494225 2.566267 -1.453124
H  1.75306 2.542715 -1.7530
H  3.077983 2.355225 2.32489
H  4.310374 2.443831 1.062402
H  -0.203922 -2.331358 1.705013
H  -0.302831 -2.703636 -0.012891
H  5.321555 -1.565307 -0.778045
H  -2.590334 -1.942975 1.882882
H  -0.263813 0.385378 -0.862787
H  -4.50653 -0.483677 1.509094
H  -2.159064 1.858074 -1.228831
H  3.107979 -4.973382 -0.20196
elementType: F O N C H
totalener: -1253.60545261 hartree
nucrepener: 2088.83875996 hartree
electener: -3342.44421258 hartree
oneelecener: -5869.20673203 hartree
twoeener: 2526.76251945 hartree
cpcmener: -0.02821567 hartree
kineticenergy: 1248.71062749 hartree
xcener: -113.865364041816 hartree
chargesum: -0.0000000
charge: -0.185151 -0.182531 -0.184362 -0.357011 -0.353981 -0.272241 -0.401824 -0.384777 0.301031 -0.107052 -0.001840 0.006136 -0.145687 0.363213 0.080140 0.086866 0.031595 -0.191398 -0.201527 -0.051575 -0.136391 -0.160938 0.176465 0.556576 0.091726 0.077392 0.069763 0.095738 0.103494 0.100688 0.085850 0.116656 0.111968 0.126889 0.142516 0.157771 0.151514 0.148371 0.135924
qa: -0.1852 -0.1825 -0.1844 -0.3570 -0.3540 -0.2722 -0.4018 -0.3848 0.3010 -0.1071 -0.0018 0.0061 -0.1457 0.3632 0.0801 0.0869 0.0316 -0.1914 -0.2015 -0.0516 -0.1364 -0.1609 0.1765 0.5566 0.0917 0.0774 0.0698 0.0957 0.1035 0.1007 0.0859 0.1167 0.1120 0.1269 0.1425 0.1578 0.1515 0.1484 0.1359
va: 1.1128 1.1190 1.1029 1.9561 1.9680 2.1533 2.9790 3.0233 4.0795 3.8556 3.8867 3.9217 3.7451 4.0577 4.0292 3.8055 3.7162 4.0030 3.9360 3.6768 3.9588 4.0438 4.0726 4.4282 1.0062 1.0246 1.0175 1.0078 0.9961 0.9961 1.0045 0.9990 1.0048 1.0188 1.0040 1.0173 1.0081 1.0118 0.9927
dispcorr: -0.017670898 hartree
energy: -1253.623123510761
dipole: 32.37474 -31.47557 0.89917 -0.68942 1.60310 0.91368 2.90639 -2.61702 0.28937
magnitude: 1.31418 au
magnitude: 3.34037 debye
