program: Orca
programVersion: 5.0.2
elementType: F F F O O O N N C C C C C C C C C C C C C C C C H H H H H H H H H H H H H H H
charge: 0
multiplicity: 1
keywords: wb97x-d3
keywords: def2-TZVPP
keywords: def2/J RIJCOSX
keywords: DEFGRID2
keywords: scfconv7
keywords: smallprint printgap noloewdin
keywords: NOSOSCF
formula: C16H15F3N2O3
InChI: InChI=1/C16H15F3N2O3/c17-16(18,19)12-4-2-11(3-5-12)9-24-14-13(8-20-10-21-14)15-22-6-1-7-23-15/h2-5,8,10,15H,1,6-7,9H2
39 atoms
F  -4.817799 1.970069 0.720277
F  -4.97862 0.040965 1.65384
F  -5.888786 0.381262 -0.260112
O  2.677824 1.487797 -0.134657
O  4.651269 0.484315 0.521749
O  1.238527 -0.779158 -1.454275
N  0.818267 -2.274231 0.225884
N  2.222415 -2.368934 2.118386
C  3.471633 0.335166 -0.201539
C  4.668136 2.841169 -0.004026
C  3.341808 2.609044 -0.704224
C  5.451979 1.540975 0.008559
C  2.67866 -0.795661 0.383832
C  1.551924 -1.30493 -0.276679
C  2.960113 -1.385381 1.596295
C  0.038178 -1.199413 -2.092919
C  -1.197341 -0.706961 -1.392489
C  -2.353596 -1.478858 -1.422261
C  -1.227015 0.526497 -0.751381
C  -3.54432 0.208087 -0.197456
C  -3.52218 -1.02743 -0.834827
C  -2.390923 0.980153 -0.14962
C  1.189068 -2.758979 1.403118
C  -4.802282 0.656026 0.474551
H  3.71941 0.124695 -1.257851
H  5.237141 3.614818 -0.523428
H  4.497378 3.187046 1.018527
H  3.501717 2.443746 -1.778686
H  2.671212 3.461595 -0.595952
H  6.333854 1.605911 0.645565
H  5.790773 1.290915 -1.006096
H  0.013614 -2.285143 -2.203043
H  0.098183 -0.766494 -3.09238
H  3.810495 -1.062689 2.183984
H  -2.343539 -2.447805 -1.906228
H  -0.34008 1.146134 -0.70542
H  -4.406208 -1.650988 -0.87357
H  -2.380997 1.940569 0.348119
H  0.575318 -3.554226 1.810392
elementType: F O N C H
totalener: -1253.60660294 hartree
nucrepener: 2088.31011695 hartree
electener: -3341.91671989 hartree
oneelecener: -5868.34475832 hartree
twoeener: 2526.42803844 hartree
cpcmener: -0.02674884 hartree
kineticenergy: 1248.71175733 hartree
xcener: -113.867115015388 hartree
chargesum: -0.0000000
charge: -0.182682 -0.183898 -0.185692 -0.338547 -0.340366 -0.291544 -0.392822 -0.383204 0.251615 -0.100139 0.001419 -0.001038 -0.123200 0.384145 0.037809 0.120691 0.025687 -0.193796 -0.195359 -0.057321 -0.151125 -0.139238 0.172299 0.557657 0.097039 0.074354 0.070824 0.088910 0.100641 0.100017 0.087047 0.110967 0.120598 0.133962 0.143118 0.144150 0.149254 0.151121 0.136648
qa: -0.1827 -0.1839 -0.1857 -0.3385 -0.3404 -0.2915 -0.3928 -0.3832 0.2516 -0.1001 0.0014 -0.0010 -0.1232 0.3841 0.0378 0.1207 0.0257 -0.1938 -0.1954 -0.0573 -0.1511 -0.1392 0.1723 0.5577 0.0970 0.0744 0.0708 0.0889 0.1006 0.1000 0.0870 0.1110 0.1206 0.1340 0.1431 0.1442 0.1493 0.1511 0.1366
va: 1.1191 1.1033 1.1120 1.9502 1.9836 2.1303 2.9574 3.0270 4.1093 3.8500 3.9074 3.9185 3.7280 4.0019 4.0953 3.7559 3.6239 4.0022 3.9690 3.6725 4.0004 3.9832 4.0786 4.4260 1.0064 1.0254 1.0198 1.0035 0.9972 0.9951 1.0042 1.0156 0.9899 1.0293 1.0005 1.0231 1.0086 1.0085 0.9933
dispcorr: -0.017619500 hartree
energy: -1253.624222437736
dipole: 40.31581 -38.54554 1.77027 4.55242 -3.73736 0.81506 -9.33851 7.11434 -2.22417
magnitude: 2.95721 au
magnitude: 7.51664 debye
