program: Orca
programVersion: 5.0.2
elementType: F F F O O O N N C C C C C C C C C C C C C C C C H H H H H H H H H H H H H H H
charge: 0
multiplicity: 1
keywords: wb97x-d3
keywords: def2-TZVPP
keywords: def2/J RIJCOSX
keywords: DEFGRID2
keywords: scfconv7
keywords: smallprint printgap noloewdin
keywords: NOSOSCF
formula: C16H15F3N2O3
InChI: InChI=1/C16H15F3N2O3/c17-16(18,19)12-4-2-11(3-5-12)9-24-14-13(8-20-10-21-14)15-22-6-1-7-23-15/h2-5,8,10,15H,1,6-7,9H2
39 atoms
F  -5.793003 1.06104 -0.51381
F  -4.783206 1.541515 1.322628
F  -5.541096 -0.444904 0.997825
O  3.850184 1.379362 1.121759
O  4.422172 0.124933 -0.735328
O  1.21427 -0.468784 -1.407543
N  0.777098 -2.041421 0.193595
N  2.081087 -2.154055 2.155093
C  3.375757 0.666397 0.021168
C  5.824918 1.989677 -0.129542
C  4.669784 2.472279 0.729235
C  5.273274 1.136988 -1.25771
C  2.543319 -0.479127 0.517556
C  1.490183 -1.019314 -0.231255
C  2.792069 -1.113724 1.716009
C  0.061148 -0.916339 -2.115889
C  -1.2221 -0.526016 -1.436606
C  -2.301661 -1.401353 -1.434158
C  -1.362161 0.717323 -0.829737
C  -3.627192 0.1920 -0.221365
C  -3.501202 -1.046674 -0.839453
C  -2.554337 1.075059 -0.221377
C  1.106777 -2.559549 1.367532
C  -4.930215 0.585431 0.399032
H  2.777231 1.342778 -0.613454
H  6.371404 2.843686 -0.534818
H  6.524835 1.406591 0.474423
H  4.068441 3.207955 0.177428
H  5.017789 2.949911 1.645123
H  6.066256 0.629996 -1.807998
H  4.719672 1.762343 -1.971779
H  0.100845 -1.994473 -2.28107
H  0.137375 -0.428456 -3.088384
H  3.594549 -0.775717 2.360832
H  -2.205276 -2.377393 -1.893778
H  -0.538252 1.419934 -0.818593
H  -4.323597 -1.750398 -0.85197
H  -2.630554 2.046313 0.24869
H  0.513814 -3.401863 1.705186
elementType: F O N C H
totalener: -1253.60589781 hartree
nucrepener: 2069.85932116 hartree
electener: -3323.46521898 hartree
oneelecener: -5831.18651262 hartree
twoeener: 2507.72129364 hartree
cpcmener: -0.02749174 hartree
kineticenergy: 1248.70433883 hartree
xcener: -113.864522698095 hartree
chargesum: 0.0000000
charge: -0.184488 -0.182892 -0.184212 -0.350596 -0.347281 -0.292389 -0.395089 -0.382169 0.252970 -0.103067 0.005380 0.000682 -0.106562 0.392589 0.029263 0.128027 0.013387 -0.185294 -0.197026 -0.054687 -0.152813 -0.137125 0.174173 0.556290 0.097080 0.073772 0.070165 0.085258 0.100551 0.101737 0.087161 0.111085 0.119917 0.129452 0.144471 0.145467 0.149911 0.150391 0.136512
qa: -0.1845 -0.1829 -0.1842 -0.3506 -0.3473 -0.2924 -0.3951 -0.3822 0.2530 -0.1031 0.0054 0.0007 -0.1066 0.3926 0.0293 0.1280 0.0134 -0.1853 -0.1970 -0.0547 -0.1528 -0.1371 0.1742 0.5563 0.0971 0.0738 0.0702 0.0853 0.1006 0.1017 0.0872 0.1111 0.1199 0.1295 0.1445 0.1455 0.1499 0.1504 0.1365
va: 1.1017 1.1177 1.1149 1.9727 1.9552 2.1274 2.9629 3.0296 4.1190 3.8347 3.9139 3.9233 3.7008 3.9905 4.1153 3.7558 3.6377 3.9830 3.9772 3.6695 4.0009 3.9731 4.0762 4.4242 1.0073 1.0243 1.0198 1.0052 0.9947 0.9973 1.0039 1.0154 0.9904 1.0318 1.0007 1.0093 1.0080 1.0088 0.9933
dispcorr: -0.017287420 hartree
energy: -1253.623185234459
dipole: 43.15711 -41.67128 1.48584 4.34873 -3.12632 1.22241 -8.34240 6.44193 -1.90047
magnitude: 2.70440 au
magnitude: 6.87404 debye
