program: Orca
programVersion: 5.0.2
elementType: F F F O O O N N C C C C C C C C C C C C C C C C H H H H H H H H H H H H H H H
charge: 0
multiplicity: 1
keywords: wb97x-d3
keywords: def2-TZVPP
keywords: def2/J RIJCOSX
keywords: DEFGRID2
keywords: scfconv7
keywords: smallprint printgap noloewdin
keywords: NOSOSCF
formula: C16H15F3N2O3
InChI: InChI=1/C16H15F3N2O3/c17-16(18,19)12-4-2-11(3-5-12)9-24-14-13(8-20-10-21-14)15-22-6-1-7-23-15/h2-5,8,10,15H,1,6-7,9H2
39 atoms
F  -4.783443 0.176918 -1.808561
F  -5.347859 1.650763 -0.352041
F  -5.752136 -0.429404 0.013998
O  2.661265 1.084405 -1.247796
O  4.184466 0.515502 0.407551
O  1.420698 0.027666 1.215539
N  0.955733 -2.175948 0.831307
N  2.180004 -3.411661 -0.763246
C  3.510193 0.095405 -0.741269
C  4.146997 2.789416 -0.402216
C  3.369614 2.266657 -1.596812
C  4.989959 1.660735 0.162543
C  2.687321 -1.106606 -0.398004
C  1.665304 -1.099698 0.564935
C  2.888258 -2.312656 -1.028413
C  0.31577 0.082332 2.109129
C  -1.007641 0.128436 1.396626
C  -1.140351 0.716404 0.141915
C  -2.138889 -0.378268 2.024573
C  -3.507446 0.282465 0.166652
C  -2.379866 0.789587 -0.47123
C  -3.384592 -0.297954 1.422297
C  1.248265 -3.279833 0.157404
C  -4.844617 0.413208 -0.491312
H  4.249074 -0.177996 -1.516193
H  4.787561 3.619375 -0.706427
H  3.460019 3.163885 0.36031
H  4.052917 2.060843 -2.433008
H  2.628218 2.986113 -1.94606
H  5.446882 1.933513 1.113731
H  5.799889 1.407273 -0.535023
H  0.466989 1.006507 2.668958
H  0.344611 -0.743497 2.822573
H  3.657244 -2.400272 -1.789308
H  -0.277286 1.118382 -0.374206
H  -2.051471 -0.847354 2.997224
H  -2.452794 1.249947 -1.448539
H  -4.244056 -0.701681 1.940707
H  0.659267 -4.157809 0.396131
elementType: F O N C H
totalener: -1253.60602308 hartree
nucrepener: 2098.91981418 hartree
electener: -3352.52583727 hartree
oneelecener: -5889.85054816 hartree
twoeener: 2537.32471089 hartree
cpcmener: -0.02937231 hartree
kineticenergy: 1248.70169203 hartree
xcener: -113.863766664649 hartree
chargesum: 0.0000000
charge: -0.184614 -0.184644 -0.182735 -0.350887 -0.354191 -0.277647 -0.396611 -0.383064 0.298139 -0.101279 0.002775 0.003999 -0.136646 0.343789 0.077418 0.123113 0.016290 -0.189546 -0.192046 -0.054935 -0.157278 -0.137336 0.173197 0.556610 0.090896 0.074539 0.069158 0.088027 0.099052 0.100579 0.085175 0.120361 0.111594 0.127259 0.142060 0.142977 0.148708 0.150338 0.137409
qa: -0.1846 -0.1846 -0.1827 -0.3509 -0.3542 -0.2776 -0.3966 -0.3831 0.2981 -0.1013 0.0028 0.0040 -0.1366 0.3438 0.0774 0.1231 0.0163 -0.1895 -0.1920 -0.0549 -0.1573 -0.1373 0.1732 0.5566 0.0909 0.0745 0.0692 0.0880 0.0991 0.1006 0.0852 0.1204 0.1116 0.1273 0.1421 0.1430 0.1487 0.1503 0.1374
va: 1.1133 1.1020 1.1185 1.9651 1.9672 2.1396 2.9516 3.0261 4.0893 3.8453 3.9067 3.9268 3.7242 4.0500 4.0339 3.7528 3.6406 3.9558 4.0081 3.6684 4.0251 3.9613 4.0811 4.4257 1.0061 1.0238 1.0201 1.0063 0.9966 0.9958 1.0041 0.9906 1.0175 1.0189 1.0273 1.0007 1.0099 1.0077 0.9930
dispcorr: -0.017679797 hartree
energy: -1253.623702877662
dipole: 40.46837 -38.41997 2.04840 7.86218 -6.36428 1.49790 3.31727 -2.88332 0.43395
magnitude: 2.57449 au
magnitude: 6.54382 debye
