program: Orca
programVersion: 5.0.2
elementType: F F F O O O N N C C C C C C C C C C C C C C C C H H H H H H H H H H H H H H H
charge: 0
multiplicity: 1
keywords: wb97x-d3
keywords: def2-TZVPP
keywords: def2/J RIJCOSX
keywords: DEFGRID2
keywords: scfconv7
keywords: smallprint printgap noloewdin
keywords: NOSOSCF
formula: C16H15F3N2O3
InChI: InChI=1/C16H15F3N2O3/c17-16(18,19)12-4-2-11(3-5-12)9-24-14-13(8-20-10-21-14)15-22-6-1-7-23-15/h2-5,8,10,15H,1,6-7,9H2
39 atoms
F  -5.617157 1.054706 0.065306
F  -5.08811 -0.604571 -1.189727
F  -4.562669 1.39555 -1.781109
O  2.655255 1.125578 -1.05486
O  4.222492 0.476458 0.5313
O  1.458207 -0.025985 1.386379
N  0.968338 -2.202954 0.908266
N  2.155691 -3.380386 -0.758503
C  3.509217 0.114943 -0.607743
C  4.152622 2.785631 -0.152164
C  3.350457 2.317066 -1.35619
C  5.012514 1.627098 0.32701
C  2.69097 -1.097176 -0.298003
C  1.684518 -1.123887 0.679454
C  2.868391 -2.278388 -0.982008
C  0.303782 0.01198 2.206237
C  -0.964888 0.133688 1.406619
C  -2.152863 -0.379817 1.913019
C  -0.984526 0.794839 0.185229
C  -3.35593 0.440433 0.00398
C  -3.341762 -0.224039 1.224998
C  -2.171939 0.942153 -0.515156
C  1.239757 -3.277311 0.180168
C  -4.653551 0.575973 -0.730887
H  4.225348 -0.128979 -1.420171
H  4.777384 3.640913 -0.419414
H  3.477243 3.103021 0.645338
H  4.023104 2.158018 -2.213498
H  2.604314 3.051511 -1.659668
H  5.500273 1.848136 1.27637
H  5.803946 1.420817 -0.41088
H  0.440764 0.90024 2.82536
H  0.258313 -0.856587 2.866482
H  3.623613 -2.343255 -1.759522
H  -2.149936 -0.915178 2.854651
H  -0.069291 1.190115 -0.237188
H  -4.253645 -0.630815 1.642425
H  -2.160525 1.456311 -1.465981
H  0.639271 -4.157162 0.382468
totalener: -1253.58092448 hartree
nucrepener: 2110.08145667 hartree
electener: -3363.66238115 hartree
oneelecener: -5911.18557842 hartree
twoeener: 2547.52319727 hartree
kineticenergy: 1248.76579776 hartree
xcener: -113.872853299130 hartree
chargesum: 0.0000000
charge: -0.176068 -0.171975 -0.175748 -0.301413 -0.291766 -0.249124 -0.352773 -0.313121 0.318731 -0.102009 -0.008872 -0.006678 -0.115703 0.304727 0.054321 0.081090 0.016835 -0.154161 -0.152189 -0.070389 -0.139057 -0.123296 0.147042 0.548488 0.050439 0.067202 0.072498 0.073903 0.087803 0.090525 0.069443 0.105867 0.102740 0.092437 0.108972 0.135726 0.122945 0.133636 0.118972
qa: -0.1761 -0.1720 -0.1757 -0.3014 -0.2918 -0.2491 -0.3528 -0.3131 0.3187 -0.1020 -0.0089 -0.0067 -0.1157 0.3047 0.0543 0.0811 0.0168 -0.1542 -0.1522 -0.0704 -0.1391 -0.1233 0.1470 0.5485 0.0504 0.0672 0.0725 0.0739 0.0878 0.0905 0.0694 0.1059 0.1027 0.0924 0.1090 0.1357 0.1229 0.1336 0.1190
va: 1.1237 1.1243 1.1291 2.0063 2.0243 2.1572 2.9677 3.0641 4.0797 3.8403 3.9375 3.9612 3.7768 4.0793 4.0674 3.8104 3.7082 4.0277 3.9762 3.7861 4.0593 3.9866 4.1083 4.4402 1.0104 1.0249 1.0196 1.0087 0.9992 0.9981 1.0052 0.9862 1.0176 1.0226 1.0102 1.0316 1.0172 1.0153 0.9941
dispcorr: -0.017958054 hartree
energy: -1253.598882536484
dipole: 39.36243 -37.80290 1.55953 7.14207 -6.00265 1.13942 5.24978 -4.78585 0.46393
magnitude: 1.98636 au
magnitude: 5.04893 debye
