program: Orca
programVersion: 5.0.2
elementType: F F F O O O N N C C C C C C C C C C C C C C C C H H H H H H H H H H H H H H H
charge: 0
multiplicity: 1
keywords: wb97x-d3
keywords: def2-TZVPP
keywords: def2/J RIJCOSX
keywords: DEFGRID2
keywords: scfconv7
keywords: smallprint printgap noloewdin
keywords: NOSOSCF
formula: C16H15F3N2O3
InChI: InChI=1/C16H15F3N2O3/c17-16(18,19)12-4-2-11(3-5-12)9-24-14-13(8-20-10-21-14)15-22-6-1-7-23-15/h2-5,8,10,15H,1,6-7,9H2
39 atoms
F  -4.845083 2.215022 -1.512069
F  -4.348073 2.765016 0.510471
F  -5.800006 1.226325 0.145894
O  4.1287 0.931835 0.985917
O  2.757419 0.811797 -0.869779
O  0.802194 -1.338113 0.13001
N  2.0707 -3.239719 0.143553
N  4.410469 -3.106514 0.435913
C  2.972954 0.381418 0.440417
C  3.79162 2.91778 -0.343789
C  4.062586 2.341123 1.037537
C  2.581088 2.210121 -0.933564
C  3.106512 -1.110393 0.409006
C  1.985419 -1.929829 0.220184
C  4.306532 -1.778249 0.511052
C  -0.354508 -2.146723 -0.067921
C  -1.507958 -1.19365 -0.138587
C  -1.951994 -0.710452 -1.360308
C  -2.106421 -0.725232 1.026459
C  -3.547728 0.701347 -0.258099
C  -2.968482 0.230184 -1.426061
C  -3.118521 0.214132 0.972023
C  3.286771 -3.762125 0.251867
C  -4.637464 1.728721 -0.285979
H  2.106611 0.67465 1.064713
H  3.612623 3.9933 -0.276188
H  4.660464 2.766004 -0.987898
H  3.270098 2.654974 1.733932
H  5.012355 2.689083 1.443415
H  2.433672 2.465518 -1.982991
H  1.670159 2.504998 -0.390564
H  -0.468295 -2.856627 0.755232
H  -0.258798 -2.728557 -0.987608
H  5.226912 -1.229513 0.666212
H  -1.494185 -1.062592 -2.276138
H  -1.772366 -1.094247 1.988203
H  -3.29244 0.593596 -2.390927
H  -3.565888 0.569088 1.891264
H  3.351384 -4.842414 0.18329
totalener: -1253.58330789 hartree
nucrepener: 2057.41818535 hartree
electener: -3311.00149325 hartree
oneelecener: -5805.46223840 hartree
twoeener: 2494.46074515 hartree
kineticenergy: 1248.77007459 hartree
xcener: -113.870887428178 hartree
chargesum: 0.0000000
charge: -0.174215 -0.174143 -0.170517 -0.301025 -0.286092 -0.255171 -0.366857 -0.312271 0.290484 -0.102374 -0.012121 -0.007357 -0.150507 0.375335 0.031669 0.071625 -0.004854 -0.124198 -0.143879 -0.067247 -0.123636 -0.142340 0.141513 0.549456 0.064286 0.064609 0.072471 0.070997 0.090226 0.090148 0.073442 0.099676 0.096060 0.122050 0.117460 0.117826 0.137014 0.125650 0.116807
qa: -0.1742 -0.1741 -0.1705 -0.3010 -0.2861 -0.2552 -0.3669 -0.3123 0.2905 -0.1024 -0.0121 -0.0074 -0.1505 0.3753 0.0317 0.0716 -0.0049 -0.1242 -0.1439 -0.0672 -0.1236 -0.1423 0.1415 0.5495 0.0643 0.0646 0.0725 0.0710 0.0902 0.0901 0.0734 0.0997 0.0961 0.1221 0.1175 0.1178 0.1370 0.1257 0.1168
va: 1.1315 1.1263 1.1274 2.0174 2.0080 2.1326 2.9749 3.0521 4.0804 3.8301 3.9524 3.9527 3.8024 4.0152 4.1017 3.8221 3.7897 3.9869 3.9816 3.8014 3.9792 4.0549 4.1099 4.4376 1.0139 1.0264 1.0195 1.0063 0.9978 0.9998 1.0060 1.0052 1.0093 1.0278 1.0110 1.0107 1.0138 1.0171 0.9930
dispcorr: -0.016337688 hartree
energy: -1253.599645582188
dipole: 32.58373 -32.60500 -0.02127 -1.29842 1.97067 0.67225 1.31061 -1.23271 0.07790
magnitude: 0.67708 au
magnitude: 1.72100 debye
