program: Orca
programVersion: 5.0.2
elementType: F F F O O O N N C C C C C C C C C C C C C C C C H H H H H H H H H H H H H H H
charge: 0
multiplicity: 1
keywords: wb97x-d3
keywords: def2-TZVPP
keywords: def2/J RIJCOSX
keywords: DEFGRID2
keywords: scfconv7
keywords: smallprint printgap noloewdin
keywords: NOSOSCF
formula: C16H15F3N2O3
InChI: InChI=1/C16H15F3N2O3/c17-16(18,19)12-4-2-11(3-5-12)9-24-14-13(8-20-10-21-14)15-22-6-1-7-23-15/h2-5,8,10,15H,1,6-7,9H2
39 atoms
F  -6.031687 0.822557 0.299574
F  -5.484362 1.67053 -1.597029
F  -4.89389 2.64711 0.230507
O  4.329001 0.833739 1.120556
O  3.030785 0.857051 -0.791228
O  0.851703 -1.144251 0.047268
N  1.971674 -3.132889 0.11577
N  4.288814 -3.195465 0.559657
C  3.151411 0.398725 0.520345
C  4.245425 2.848477 -0.202063
C  4.396708 2.24243 1.184398
C  2.998237 2.266385 -0.849933
C  3.152464 -1.098463 0.477219
C  1.983738 -1.821048 0.206651
C  4.285956 -1.864482 0.645649
C  -0.327556 -1.885346 -0.22032
C  -1.495206 -0.946676 -0.285271
C  -2.558256 -1.25702 -1.126188
C  -1.58737 0.182952 0.518067
C  -3.784492 0.649655 -0.340829
C  -3.696681 -0.473065 -1.153692
C  -2.723004 0.977534 0.489946
C  3.129904 -3.755179 0.294477
C  -5.046681 1.455287 -0.351066
H  2.290542 0.766963 1.113082
H  4.171233 3.936192 -0.134143
H  5.1230 2.613799 -0.808411
H  3.607912 2.627569 1.848591
H  5.356211 2.494282 1.635845
H  2.9225 2.539667 -1.902233
H  2.098293 2.648311 -0.343633
H  -0.490769 -2.629834 0.565189
H  -0.225585 -2.437156 -1.158299
H  5.235638 -1.393507 0.864945
H  -2.498237 -2.125114 -1.771196
H  -0.771773 0.452964 1.174884
H  -4.507951 -0.738118 -1.81864
H  -2.770153 1.85136 1.124894
H  3.109293 -4.836476 0.216027
totalener: -1253.58333396 hartree
nucrepener: 2039.71681291 hartree
electener: -3293.30014687 hartree
oneelecener: -5769.95334767 hartree
twoeener: 2476.65320079 hartree
kineticenergy: 1248.76100766 hartree
xcener: -113.872809765484 hartree
chargesum: -0.0000000
charge: -0.170327 -0.174779 -0.174814 -0.301276 -0.283220 -0.270335 -0.366607 -0.310900 0.289878 -0.105974 -0.013150 -0.002396 -0.134455 0.365714 0.029162 0.085650 0.042201 -0.161243 -0.156493 -0.064442 -0.141184 -0.125927 0.141634 0.544825 0.057993 0.065614 0.073604 0.070336 0.092185 0.092584 0.068426 0.104852 0.096644 0.123496 0.114505 0.120804 0.126586 0.133402 0.117426
qa: -0.1703 -0.1748 -0.1748 -0.3013 -0.2832 -0.2703 -0.3666 -0.3109 0.2899 -0.1060 -0.0132 -0.0024 -0.1345 0.3657 0.0292 0.0857 0.0422 -0.1612 -0.1565 -0.0644 -0.1412 -0.1259 0.1416 0.5448 0.0580 0.0656 0.0736 0.0703 0.0922 0.0926 0.0684 0.1049 0.0966 0.1235 0.1145 0.1208 0.1266 0.1334 0.1174
va: 1.1241 1.1267 1.1302 2.0194 2.0082 2.1437 2.9839 3.0529 4.0952 3.8331 3.9509 3.9484 3.7911 4.0195 4.1050 3.8059 3.7332 4.0164 4.0000 3.7990 4.0654 3.9998 4.1093 4.4424 1.0116 1.0262 1.0195 1.0057 0.9980 1.0001 1.0066 1.0000 1.0091 1.0278 1.0123 1.0215 1.0177 1.0155 0.9934
dispcorr: -0.016337391 hartree
energy: -1253.599671351852
dipole: 36.48659 -36.13678 0.34981 0.67173 0.09552 0.76726 1.78352 -1.70881 0.07471
magnitude: 0.84654 au
magnitude: 2.15174 debye
