program: Orca
programVersion: 5.0.2
elementType: F F F O O O N N C C C C C C C C C C C C C C C C H H H H H H H H H H H H H H H
charge: 0
multiplicity: 1
keywords: wb97x-d3
keywords: def2-TZVPP
keywords: def2/J RIJCOSX
keywords: DEFGRID2
keywords: scfconv7
keywords: smallprint printgap noloewdin
keywords: NOSOSCF
formula: C16H15F3N2O3
InChI: InChI=1/C16H15F3N2O3/c17-16(18,19)12-4-2-11(3-5-12)9-24-14-13(8-20-10-21-14)15-22-6-1-7-23-15/h2-5,8,10,15H,1,6-7,9H2
39 atoms
F  -5.763677 1.153999 -0.66129
F  -4.762339 1.734115 1.146228
F  -5.551438 -0.261646 0.943642
O  4.014648 1.145481 1.267899
O  4.22362 0.263128 -0.857924
O  1.224952 -0.448787 -1.338665
N  0.869393 -2.174902 0.117665
N  2.179139 -2.392034 2.068888
C  3.343504 0.641095 0.157405
C  5.755731 1.987521 -0.172828
C  4.77644 2.290529 0.95061
C  4.986014 1.355547 -1.322387
C  2.572258 -0.575771 0.571022
C  1.534424 -1.09024 -0.21591
C  2.844746 -1.291347 1.717794
C  0.100036 -0.904301 -2.083195
C  -1.199842 -0.499816 -1.445019
C  -2.121978 -1.449532 -1.032045
C  -1.495931 0.847613 -1.261606
C  -3.617504 0.276248 -0.291494
C  -3.329532 -1.068796 -0.466547
C  -2.692833 1.236044 -0.689569
C  1.22876 -2.773892 1.245201
C  -4.92592 0.720402 0.289056
H  2.655645 1.417943 -0.22977
H  6.252798 2.903341 -0.501017
H  6.527575 1.299947 0.179986
H  4.110972 3.115336 0.652474
H  5.286814 2.595935 1.86405
H  5.652409 0.973278 -2.095729
H  4.331567 2.106833 -1.791437
H  0.141794 -1.984772 -2.228118
H  0.21016 -0.425807 -3.056781
H  3.627178 -0.965514 2.391289
H  -1.889396 -2.500822 -1.139286
H  -0.784373 1.604201 -1.568885
H  -4.03081 -1.829854 -0.154263
H  -2.899812 2.289328 -0.554269
H  0.675506 -3.667771 1.510677
totalener: -1253.58303486 hartree
nucrepener: 2068.68381548 hartree
electener: -3322.26685035 hartree
oneelecener: -5828.23264739 hartree
twoeener: 2505.96579704 hartree
kineticenergy: 1248.75840587 hartree
xcener: -113.871469220885 hartree
chargesum: 0.0000000
charge: -0.170690 -0.174519 -0.174015 -0.300281 -0.284611 -0.265650 -0.374870 -0.311352 0.278322 -0.104125 -0.012612 -0.007151 -0.139530 0.388555 0.028007 0.082838 -0.028868 -0.098093 -0.170427 -0.063093 -0.132904 -0.126196 0.148302 0.545485 0.063387 0.065331 0.072976 0.070795 0.091248 0.091446 0.069530 0.101778 0.111977 0.121068 0.115156 0.117790 0.134605 0.126081 0.114313
qa: -0.1707 -0.1745 -0.1740 -0.3003 -0.2846 -0.2656 -0.3749 -0.3114 0.2783 -0.1041 -0.0126 -0.0072 -0.1395 0.3886 0.0280 0.0828 -0.0289 -0.0981 -0.1704 -0.0631 -0.1329 -0.1262 0.1483 0.5455 0.0634 0.0653 0.0730 0.0708 0.0912 0.0914 0.0695 0.1018 0.1120 0.1211 0.1152 0.1178 0.1346 0.1261 0.1143
va: 1.1230 1.1272 1.1313 2.0166 2.0100 2.1381 2.9716 3.0596 4.1044 3.8287 3.9515 3.9532 3.7857 4.0079 4.1094 3.8100 3.7071 3.9476 4.0098 3.7907 4.0111 4.0330 4.1060 4.4382 1.0113 1.0262 1.0198 1.0062 0.9981 0.9997 1.0059 1.0169 0.9896 1.0296 1.0213 1.0150 1.0141 1.0166 0.9954
dispcorr: -0.017136847 hartree
energy: -1253.600171710471
dipole: 42.67581 -41.47694 1.19887 3.90239 -3.02080 0.88159 -7.21388 6.05740 -1.15648
magnitude: 1.88466 au
magnitude: 4.79043 debye
