program: Orca
programVersion: 5.0.2
elementType: F F F O O O N N C C C C C C C C C C C C C C C C H H H H H H H H H H H H H H H
charge: 0
multiplicity: 1
keywords: wb97x-d3
keywords: def2-TZVPP
keywords: def2/J RIJCOSX
keywords: DEFGRID2
keywords: scfconv7
keywords: smallprint printgap noloewdin
keywords: NOSOSCF
formula: C16H15F3N2O3
InChI: InChI=1/C16H15F3N2O3/c17-16(18,19)12-4-2-11(3-5-12)9-24-14-13(8-20-10-21-14)15-22-6-1-7-23-15/h2-5,8,10,15H,1,6-7,9H2
39 atoms
F  -6.010201 0.367131 -0.428824
F  -5.018572 1.923836 0.679961
F  -5.187038 -0.058034 1.50566
O  3.438286 1.574742 0.825568
O  4.750042 0.066193 -0.338175
O  1.1627 -0.526404 -1.480192
N  0.798125 -2.083523 0.152607
N  2.199136 -2.205267 2.048488
C  3.460171 0.564285 -0.139033
C  5.675025 2.22305 0.200582
C  4.245471 2.672763 0.457479
C  5.641139 1.065741 -0.784412
C  2.613645 -0.564959 0.362496
C  1.505411 -1.076437 -0.315189
C  2.906241 -1.190908 1.559039
C  -0.008475 -1.00747 -2.12219
C  -1.274391 -0.577016 -1.433344
C  -1.426052 0.718976 -0.958396
C  -2.333574 -1.466406 -1.30334
C  -3.672938 0.231877 -0.260866
C  -2.615018 1.122075 -0.370087
C  -3.52728 -1.067837 -0.731282
C  1.179557 -2.596722 1.312021
C  -4.971119 0.624827 0.375275
H  3.073526 0.964798 -1.092977
H  6.269026 3.048392 -0.198455
H  6.139817 1.90333 1.135839
H  3.840334 3.155955 -0.445218
H  4.186863 3.396751 1.270161
H  6.618057 0.594767 -0.89351
H  5.337364 1.430216 -1.777911
H  0.020327 -2.094581 -2.219481
H  0.038205 -0.57756 -3.123966
H  3.750725 -0.85852 2.151657
H  -0.611301 1.427313 -1.037947
H  -2.221913 -2.487646 -1.644842
H  -2.705023 2.135467 -0.004686
H  -4.337933 -1.779391 -0.64334
H  0.587381 -3.422956 1.689462
totalener: -1253.58216945 hartree
nucrepener: 2065.19575357 hartree
electener: -3318.77792302 hartree
oneelecener: -5821.26083401 hartree
twoeener: 2502.48291099 hartree
kineticenergy: 1248.76194325 hartree
xcener: -113.871600278583 hartree
chargesum: -0.0000000
charge: -0.175140 -0.175093 -0.171302 -0.300760 -0.298754 -0.293339 -0.359496 -0.307065 0.251345 -0.110545 -0.001456 -0.003852 -0.112143 0.418125 -0.011423 0.106164 0.014856 -0.171026 -0.137439 -0.074138 -0.108785 -0.142429 0.146439 0.549268 0.080226 0.066604 0.072900 0.067117 0.092477 0.092023 0.068368 0.099422 0.107603 0.111745 0.121952 0.109862 0.136941 0.123655 0.117092
qa: -0.1751 -0.1751 -0.1713 -0.3008 -0.2988 -0.2933 -0.3595 -0.3071 0.2513 -0.1105 -0.0015 -0.0039 -0.1121 0.4181 -0.0114 0.1062 0.0149 -0.1710 -0.1374 -0.0741 -0.1088 -0.1424 0.1464 0.5493 0.0802 0.0666 0.0729 0.0671 0.0925 0.0920 0.0684 0.0994 0.1076 0.1117 0.1220 0.1099 0.1369 0.1237 0.1171
va: 1.1249 1.1306 1.1267 2.0129 2.0203 2.1236 2.9793 3.0590 4.1011 3.8397 3.9427 3.9483 3.7641 3.9037 4.1546 3.8002 3.6989 4.0097 4.0051 3.7945 3.9651 4.0671 4.1096 4.4403 1.0221 1.0257 1.0199 1.0080 0.9976 0.9980 1.0075 1.0191 0.9865 1.0303 1.0187 1.0123 1.0125 1.0172 0.9940
dispcorr: -0.017160786 hartree
energy: -1253.599330234275
dipole: 43.22416 -41.88797 1.33619 4.23172 -3.50251 0.72921 -7.76187 6.43030 -1.33158
magnitude: 2.02244 au
magnitude: 5.14062 debye
