program: Orca
programVersion: 5.0.2
elementType: Cl O O O O O N C C C C C C C C C C C C C C C C C C H H H H H H H H H H H H H H H H H H
charge: 0
multiplicity: 1
keywords: wb97x-d3
keywords: def2-TZVPP
keywords: def2/J RIJCOSX
keywords: DEFGRID2
keywords: scfconv7
keywords: smallprint printgap noloewdin
keywords: NOSOSCF
formula: C18H18ClNO5
InChI: InChI=1/C18H18ClNO5/c1-4-24-20-17(25-18(21)12-8-6-5-7-9-12)15-14(22-2)11-10-13(19)16(15)23-3/h5-11H,4H2,1-3H3
43 atoms
Cl 1.411658 2.632851 -3.017432
O  0.082488 0.14653 -2.126762
O  2.093976 -0.10277 2.106817
O  -1.01761 -1.104048 0.286133
O  2.149475 -2.429596 0.285171
O  -0.975554 0.233861 2.074895
N  0.800709 -2.365345 0.410034
C  1.115764 0.042346 0.003638
C  0.939395 0.675936 -1.221919
C  1.997223 0.570968 0.955183
C  0.355189 -1.187954 0.276945
C  1.642736 1.844209 -1.49956
C  2.691799 1.740593 0.664341
C  2.505417 2.370842 -0.556064
C  -3.040876 -0.110435 0.943671
C  -1.596537 -0.281401 1.18171
C  -3.755903 0.695443 1.829552
C  -3.698788 -0.72027 -0.124712
C  0.685738 -0.764322 -3.048021
C  2.964417 0.385495 3.115027
C  -5.114634 0.887725 1.651206
C  -5.060032 -0.526207 -0.295437
C  -5.768442 0.276002 0.589052
C  2.586369 -3.786546 0.214683
C  2.258836 -4.437757 -1.107911
H  3.373539 2.183088 1.376564
H  3.048505 3.281938 -0.767931
H  -3.252244 1.1732 2.659002
H  -3.165509 -1.346058 -0.826555
H  -0.107879 -1.129791 -3.695123
H  1.142007 -1.612241 -2.532166
H  1.445013 -0.273517 -3.660096
H  2.675789 1.383891 3.450098
H  4.002944 0.403911 2.777883
H  2.878191 -0.304269 3.950457
H  -5.66337 1.514258 2.34115
H  -5.568394 -1.001678 -1.123183
H  -6.831379 0.424175 0.451144
H  2.169439 -4.354087 1.050496
H  3.665132 -3.726109 0.358289
H  2.666402 -5.449057 -1.121968
H  1.183462 -4.513098 -1.270797
H  2.69884 -3.890243 -1.942408
elementType: Cl O N C H
totalener: -1587.87138028 hartree
nucrepener: 2413.23931337 hartree
electener: -4001.11069365 hartree
oneelecener: -6974.32234610 hartree
twoeener: 2973.21165244 hartree
cpcmener: -0.03823668 hartree
kineticenergy: 1582.54809410 hartree
xcener: -127.801945921918 hartree
chargesum: 0.0000000
charge: -0.087516 -0.383797 -0.322413 -0.256317 -0.225645 -0.448895 -0.089623 -0.159479 0.266647 0.370431 0.221563 -0.033933 -0.279803 -0.119103 -0.016003 0.567216 -0.155084 -0.203839 -0.086873 -0.137493 -0.159798 -0.151310 -0.121860 0.049822 -0.268941 0.147028 0.144611 0.146428 0.153406 0.127912 0.095568 0.102690 0.118249 0.119178 0.124594 0.163231 0.162894 0.164967 0.083816 0.098720 0.104444 0.090236 0.084076
qa: -0.0875 -0.3838 -0.3224 -0.2563 -0.2256 -0.4489 -0.0896 -0.1595 0.2666 0.3704 0.2216 -0.0339 -0.2798 -0.1191 -0.0160 0.5672 -0.1551 -0.2038 -0.0869 -0.1375 -0.1598 -0.1513 -0.1219 0.0498 -0.2689 0.1470 0.1446 0.1464 0.1534 0.1279 0.0956 0.1027 0.1182 0.1192 0.1246 0.1632 0.1629 0.1650 0.0838 0.0987 0.1044 0.0902 0.0841
va: 1.2273 1.9668 2.0621 2.1454 1.9608 2.0642 2.9194 3.6670 3.8861 3.7797 4.0784 3.9365 3.9442 4.0134 3.5844 3.9944 3.9855 4.0087 3.8443 3.8723 3.9145 3.9011 3.8976 3.8733 3.9044 1.0069 1.0053 1.0208 1.0152 0.9930 0.9910 0.9990 0.9857 0.9854 0.9935 0.9912 0.9909 0.9873 1.0092 0.9938 1.0111 1.0081 1.0040
dispcorr: -0.021448245 hartree
energy: -1587.892828529485
dipole: 3.87962 -3.23404 0.64558 -18.16809 17.84282 -0.32527 6.11187 -6.21903 -0.10715
magnitude: 0.73079 au
magnitude: 1.85753 debye
