program: Orca
programVersion: 5.0.2
elementType: Cl O O O O O N C C C C C C C C C C C C C C C C C C H H H H H H H H H H H H H H H H H H
charge: 0
multiplicity: 1
keywords: wb97x-d3
keywords: def2-TZVPP
keywords: def2/J RIJCOSX
keywords: DEFGRID2
keywords: scfconv7
keywords: smallprint printgap noloewdin
keywords: NOSOSCF
formula: C18H18ClNO5
InChI: InChI=1/C18H18ClNO5/c1-4-24-20-17(25-18(21)12-8-6-5-7-9-12)15-14(22-2)11-10-13(19)16(15)23-3/h5-11H,4H2,1-3H3
43 atoms
Cl 2.298794 2.569353 2.466795
O  0.735635 0.109478 1.992228
O  1.217745 0.012856 -2.680197
O  -1.050533 -1.141928 0.121901
O  1.874466 -2.378133 -1.161694
O  -1.71002 0.472278 -1.276485
N  0.564823 -2.320655 -0.813192
C  1.019851 0.059175 -0.362287
C  1.257452 0.659654 0.870313
C  1.535866 0.627886 -1.535028
C  0.211806 -1.170428 -0.416999
C  2.024266 1.819007 0.935448
C  2.310334 1.779984 -1.452396
C  2.544771 2.370146 -0.220344
C  -3.127129 -0.142165 0.540105
C  -1.921421 -0.208179 -0.306849
C  -3.369107 -1.063563 1.56006
C  -4.038722 0.886697 0.304115
C  1.598765 -0.825539 2.643494
C  1.794449 0.479876 -3.889529
C  -4.515403 -0.953622 2.330255
C  -5.175358 0.998511 1.086424
C  -5.415641 0.077848 2.098616
C  2.163135 -3.604859 -1.830298
C  1.63671 -3.638352 -3.246161
H  2.725135 2.244436 -2.335542
H  3.141304 3.270868 -0.170026
H  -2.678249 -1.8713 1.756494
H  -3.856006 1.606062 -0.482793
H  2.5161 -0.348545 2.993502
H  1.860222 -1.654027 1.981918
H  1.052338 -1.213352 3.499831
H  1.441116 -0.185267 -4.673098
H  2.885217 0.440935 -3.856882
H  1.476711 1.498182 -4.122791
H  -4.704062 -1.673332 3.115268
H  -5.874493 1.803952 0.907208
H  -6.305573 0.16454 2.707991
H  1.777926 -4.443966 -1.245327
H  3.251374 -3.664556 -1.82214
H  1.944536 -4.56934 -3.722945
H  0.547776 -3.59614 -3.2774
H  2.034118 -2.813667 -3.839461
elementType: Cl O N C H
totalener: -1587.87090439 hartree
nucrepener: 2419.67473457 hartree
electener: -4007.54563895 hartree
oneelecener: -6987.22197479 hartree
twoeener: 2979.67633584 hartree
cpcmener: -0.03777474 hartree
kineticenergy: 1582.54092996 hartree
xcener: -127.800654716318 hartree
chargesum: 0.0000000
charge: -0.088254 -0.385258 -0.324693 -0.254350 -0.228576 -0.444297 -0.103405 -0.140206 0.267021 0.341692 0.226700 -0.025547 -0.262091 -0.126522 -0.008719 0.559389 -0.201727 -0.157849 -0.100299 -0.144595 -0.151562 -0.159998 -0.121883 0.053115 -0.266353 0.145889 0.143736 0.152670 0.146457 0.101451 0.109462 0.128095 0.123476 0.123605 0.126836 0.162831 0.163351 0.165409 0.085208 0.099350 0.100706 0.089254 0.080476
qa: -0.0883 -0.3853 -0.3247 -0.2544 -0.2286 -0.4443 -0.1034 -0.1402 0.2670 0.3417 0.2267 -0.0255 -0.2621 -0.1265 -0.0087 0.5594 -0.2017 -0.1578 -0.1003 -0.1446 -0.1516 -0.1600 -0.1219 0.0531 -0.2664 0.1459 0.1437 0.1527 0.1465 0.1015 0.1095 0.1281 0.1235 0.1236 0.1268 0.1628 0.1634 0.1654 0.0852 0.0994 0.1007 0.0893 0.0805
va: 1.2262 1.9607 2.0602 2.1440 1.9571 2.0703 2.9080 3.6496 3.8814 3.7938 4.0500 3.9304 3.9390 4.0253 3.5849 3.9911 4.0090 3.9887 3.8451 3.8618 3.8997 3.9170 3.8966 3.8612 3.9221 1.0063 1.0059 1.0156 1.0198 0.9974 0.9909 0.9923 0.9910 0.9849 0.9872 0.9909 0.9911 0.9872 1.0102 0.9949 1.0119 1.0069 1.0035
dispcorr: -0.021880914 hartree
energy: -1587.892785299033
dipole: 0.13816 0.57864 0.71680 -16.48471 16.08792 -0.39679 -15.36594 14.91290 -0.45304
magnitude: 0.93621 au
magnitude: 2.37965 debye
