program: Orca
programVersion: 5.0.2
elementType: Cl O O O O O N C C C C C C C C C C C C C C C C C C H H H H H H H H H H H H H H H H H H
charge: 0
multiplicity: 1
keywords: wb97x-d3
keywords: def2-TZVPP
keywords: def2/J RIJCOSX
keywords: DEFGRID2
keywords: scfconv7
keywords: smallprint printgap noloewdin
keywords: NOSOSCF
formula: C18H18ClNO5
InChI: InChI=1/C18H18ClNO5/c1-4-24-20-17(25-18(21)12-8-6-5-7-9-12)15-14(22-2)11-10-13(19)16(15)23-3/h5-11H,4H2,1-3H3
43 atoms
Cl 1.520419 3.431086 -1.933068
O  -0.010738 0.892055 -1.966548
O  1.914295 -0.988587 1.875064
O  -1.209543 -1.07853 -0.203411
O  1.870375 -2.519968 -0.635413
O  -1.168888 -0.28916 1.885251
N  0.528187 -2.423289 -0.455119
C  0.996772 -0.043433 -0.040025
C  0.8813 0.998718 -0.953322
C  1.900705 0.045399 1.026685
C  0.15481 -1.238747 -0.208119
C  1.677913 2.130385 -0.807617
C  2.695371 1.179112 1.154671
C  2.574474 2.214602 0.241056
C  -3.204025 -0.186265 0.652773
C  -1.781094 -0.501808 0.87124
C  -3.848986 -0.450316 -0.55551
C  -3.909694 0.403756 1.701303
C  0.529711 0.360726 -3.178626
C  2.87646 -1.006129 2.916732
C  -5.188308 -0.129004 -0.705791
C  -5.246438 0.725311 1.543071
C  -5.887187 0.45891 0.33998
C  2.285053 -3.884131 -0.583871
C  2.301199 -4.435681 0.822562
H  3.40249 1.283261 1.965263
H  3.192116 3.094947 0.355327
H  -3.320367 -0.903397 -1.382301
H  -3.416841 0.612814 2.64107
H  -0.309164 0.187537 -3.847613
H  1.046632 -0.584754 -3.003656
H  1.220968 1.06126 -3.649429
H  3.894915 -0.980855 2.523882
H  2.728069 -1.939392 3.453489
H  2.735958 -0.175651 3.611545
H  -5.686271 -0.33605 -1.643252
H  -5.789236 1.183482 2.358543
H  -6.932296 0.710644 0.216875
H  3.289481 -3.876644 -1.006954
H  1.650242 -4.487333 -1.238049
H  1.306018 -4.445521 1.267846
H  2.662927 -5.464018 0.801623
H  2.9666 -3.863043 1.46976
elementType: Cl O N C H
totalener: -1587.87118554 hartree
nucrepener: 2419.67516792 hartree
electener: -4007.54635346 hartree
oneelecener: -6987.21934132 hartree
twoeener: 2979.67298786 hartree
cpcmener: -0.03770379 hartree
kineticenergy: 1582.55820091 hartree
xcener: -127.803752593302 hartree
chargesum: -0.0000000
charge: -0.088755 -0.384880 -0.324174 -0.254935 -0.229358 -0.447025 -0.101025 -0.156119 0.265895 0.352516 0.233092 -0.023758 -0.268281 -0.125364 -0.014420 0.566961 -0.203077 -0.155979 -0.100091 -0.148054 -0.152273 -0.160420 -0.121811 0.056692 -0.268862 0.146177 0.144356 0.153707 0.146997 0.127902 0.108027 0.102013 0.125017 0.123747 0.128316 0.163294 0.163170 0.165315 0.099296 0.084229 0.090326 0.101400 0.080218
qa: -0.0888 -0.3849 -0.3242 -0.2549 -0.2294 -0.4470 -0.1010 -0.1561 0.2659 0.3525 0.2331 -0.0238 -0.2683 -0.1254 -0.0144 0.5670 -0.2031 -0.1560 -0.1001 -0.1481 -0.1523 -0.1604 -0.1218 0.0567 -0.2689 0.1462 0.1444 0.1537 0.1470 0.1279 0.1080 0.1020 0.1250 0.1237 0.1283 0.1633 0.1632 0.1653 0.0993 0.0842 0.0903 0.1014 0.0802
va: 1.2257 1.9634 2.0572 2.1466 1.9546 2.0681 2.9105 3.6550 3.8828 3.7829 4.0567 3.9235 3.9489 4.0267 3.5845 3.9898 4.0094 3.9870 3.8417 3.8606 3.9021 3.9159 3.8977 3.8575 3.9210 1.0065 1.0057 1.0150 1.0205 0.9920 0.9923 0.9990 0.9846 0.9906 0.9876 0.9908 0.9912 0.9872 0.9949 1.0108 1.0065 1.0125 1.0030
dispcorr: -0.021983354 hartree
energy: -1587.893168895157
dipole: 3.80295 -3.07216 0.73078 -20.90749 20.44464 -0.46284 7.36096 -7.22929 0.13167
magnitude: 0.87499 au
magnitude: 2.22404 debye
