program: Orca
programVersion: 5.0.2
elementType: Cl O O O O O N C C C C C C C C C C C C C C C C C C H H H H H H H H H H H H H H H H H H
charge: 0
multiplicity: 1
keywords: wb97x-d3
keywords: def2-TZVPP
keywords: def2/J RIJCOSX
keywords: DEFGRID2
keywords: scfconv7
keywords: smallprint printgap noloewdin
keywords: NOSOSCF
formula: C18H18ClNO5
InChI: InChI=1/C18H18ClNO5/c1-4-24-20-17(25-18(21)12-8-6-5-7-9-12)15-14(22-2)11-10-13(19)16(15)23-3/h5-11H,4H2,1-3H3
43 atoms
Cl 4.12052 1.552292 -1.691267
O  2.400074 -0.776464 -1.195966
O  -0.579869 1.324838 1.771543
O  -1.203718 -0.978131 0.370083
O  1.913061 -2.037185 1.270336
O  -1.293814 0.327541 -1.45113
N  0.606229 -2.070138 0.919556
C  0.902658 0.296032 0.311506
C  2.011174 0.330623 -0.532115
C  0.504438 1.453971 0.994856
C  0.159783 -0.960574 0.507351
C  2.724046 1.518865 -0.673306
C  1.223028 2.632806 0.837742
C  2.333873 2.655031 0.009696
C  -3.297765 -0.16101 -0.268489
C  -1.844919 -0.218008 -0.53344
C  -3.880823 -0.784235 0.834927
C  -4.096664 0.55167 -1.162329
C  1.879704 -0.92022 -2.515512
C  -1.065293 2.458155 2.469621
C  -5.249035 -0.696423 1.033885
C  -5.462578 0.638181 -0.955978
C  -6.040615 0.013746 0.141745
C  2.403737 -3.36157 1.456576
C  2.606975 -4.103563 0.155142
H  0.943529 3.538813 1.356439
H  2.89508 3.573089 -0.101949
H  -3.279736 -1.338269 1.542505
H  -3.651586 1.03847 -2.020078
H  2.353128 -1.802595 -2.943206
H  2.112611 -0.057682 -3.1450
H  0.798345 -1.070929 -2.505576
H  -1.35009 3.263298 1.787929
H  -0.33455 2.83448 3.189573
H  -1.950112 2.126935 3.008212
H  -5.69746 -1.18269 1.890056
H  -6.077509 1.192493 -1.652657
H  -7.109098 0.07998 0.301634
H  1.732546 -3.912981 2.121528
H  3.35289 -3.22851 1.977104
H  1.669823 -4.232556 -0.388716
H  3.317709 -3.589721 -0.493218
H  3.006053 -5.097289 0.363196
elementType: Cl O N C H
totalener: -1587.87660094 hartree
nucrepener: 2427.93471224 hartree
electener: -4015.81131318 hartree
oneelecener: -7003.15818962 hartree
twoeener: 2987.34687644 hartree
cpcmener: -0.02838705 hartree
kineticenergy: 1582.55615014 hartree
xcener: -127.805135795671 hartree
chargesum: 0.0000000
charge: -0.089503 -0.358882 -0.320861 -0.247010 -0.217870 -0.418805 -0.118663 -0.156479 0.281543 0.328783 0.269075 -0.048084 -0.264041 -0.118347 -0.007008 0.528456 -0.194155 -0.158973 -0.108772 -0.142353 -0.147014 -0.154241 -0.121966 0.054697 -0.269838 0.143700 0.140579 0.150004 0.145449 0.121046 0.103823 0.107047 0.118214 0.123004 0.122138 0.159040 0.159384 0.161397 0.081466 0.095267 0.088519 0.081884 0.098348
qa: -0.0895 -0.3589 -0.3209 -0.2470 -0.2179 -0.4188 -0.1187 -0.1565 0.2815 0.3288 0.2691 -0.0481 -0.2640 -0.1183 -0.0070 0.5285 -0.1942 -0.1590 -0.1088 -0.1424 -0.1470 -0.1542 -0.1220 0.0547 -0.2698 0.1437 0.1406 0.1500 0.1454 0.1210 0.1038 0.1070 0.1182 0.1230 0.1221 0.1590 0.1594 0.1614 0.0815 0.0953 0.0885 0.0819 0.0983
va: 1.2250 1.9793 2.0804 2.1495 1.9703 2.0869 2.9294 3.6676 3.8557 3.8373 4.0248 3.9391 3.9514 4.0259 3.5780 4.0151 4.0024 3.9992 3.8488 3.8729 3.9031 3.9154 3.9031 3.8729 3.9104 1.0061 1.0071 1.0165 1.0211 0.9915 0.9977 0.9966 0.9854 0.9858 0.9929 0.9922 0.9923 0.9886 1.0110 0.9950 1.0078 1.0091 1.0125
dispcorr: -0.022519914 hartree
energy: -1587.899120856236
dipole: -12.18223 10.43253 -1.74970 -9.50663 10.47736 0.97073 6.53051 -5.53591 0.99460
magnitude: 2.23450 au
magnitude: 5.67965 debye
