program: Orca
programVersion: 5.0.2
elementType: Cl O O O O O N C C C C C C C C C C C C C C C C C C H H H H H H H H H H H H H H H H H H
charge: 0
multiplicity: 1
keywords: wb97x-d3
keywords: def2-TZVPP
keywords: def2/J RIJCOSX
keywords: DEFGRID2
keywords: scfconv7
keywords: smallprint printgap noloewdin
keywords: NOSOSCF
formula: C18H18ClNO5
InChI: InChI=1/C18H18ClNO5/c1-4-24-20-17(25-18(21)12-8-6-5-7-9-12)15-14(22-2)11-10-13(19)16(15)23-3/h5-11H,4H2,1-3H3
43 atoms
Cl 3.976949 2.060094 -1.538135
O  2.215714 -0.318175 -1.601045
O  -0.295951 0.74199 2.221272
O  -1.198137 -0.967598 0.188444
O  1.957789 -2.256941 0.422772
O  -1.332445 0.566284 -1.443574
N  0.623088 -2.19187 0.230312
C  0.937134 0.244785 0.314707
C  1.945133 0.538671 -0.601845
C  0.678142 1.119703 1.377057
C  0.174713 -1.011661 0.202292
C  2.686264 1.71099 -0.445871
C  1.414841 2.289512 1.509133
C  2.419137 2.573059 0.598027
C  -3.313224 -0.117881 -0.326711
C  -1.856343 -0.108791 -0.602671
C  -3.881575 -0.893616 0.681359
C  -4.12827 0.682552 -1.123653
C  1.693858 0.01661 -2.880791
C  -0.617437 1.579632 3.303392
C  -5.252132 -0.868064 0.882737
C  -5.496484 0.705398 -0.917837
C  -6.06038 -0.071091 0.084945
C  2.404513 -3.595598 0.289117
C  1.94166 -4.496159 1.415298
H  1.236637 2.981876 2.318959
H  3.003947 3.475708 0.708565
H  -3.260196 -1.519707 1.305865
H  -3.683191 1.284586 -1.904114
H  2.032346 0.997657 -3.220305
H  0.604967 -0.003326 -2.880974
H  2.069542 -0.736604 -3.569646
H  -1.425701 1.090115 3.84113
H  -0.964056 2.563459 2.973232
H  0.227352 1.712646 3.985753
H  -5.690923 -1.474472 1.663896
H  -6.124825 1.327057 -1.54167
H  -7.130859 -0.056709 0.243166
H  3.491814 -3.513509 0.28208
H  2.096337 -3.997485 -0.680652
H  2.357561 -5.495788 1.283347
H  2.272432 -4.120642 2.383741
H  0.856156 -4.583714 1.432219
totalener: -1587.85701161 hartree
nucrepener: 2410.61246717 hartree
electener: -3998.46947878 hartree
oneelecener: -6966.97856601 hartree
twoeener: 2968.50908724 hartree
kineticenergy: 1582.60918342 hartree
xcener: -127.810787426252 hartree
chargesum: 0.0000000
charge: -0.078973 -0.322708 -0.292215 -0.232290 -0.179457 -0.373275 -0.081320 -0.130289 0.303570 0.296787 0.247559 -0.046887 -0.237878 -0.119824 -0.031796 0.500751 -0.182018 -0.143539 -0.119187 -0.153603 -0.116315 -0.121246 -0.104103 0.043285 -0.242540 0.110862 0.114459 0.136236 0.138396 0.088788 0.113123 0.108365 0.115016 0.104009 0.105806 0.128441 0.128272 0.130218 0.083012 0.067638 0.074322 0.077816 0.092734
qa: -0.0790 -0.3227 -0.2922 -0.2323 -0.1795 -0.3733 -0.0813 -0.1303 0.3036 0.2968 0.2476 -0.0469 -0.2379 -0.1198 -0.0318 0.5008 -0.1820 -0.1435 -0.1192 -0.1536 -0.1163 -0.1212 -0.1041 0.0433 -0.2425 0.1109 0.1145 0.1362 0.1384 0.0888 0.1131 0.1084 0.1150 0.1040 0.1058 0.1284 0.1283 0.1302 0.0830 0.0676 0.0743 0.0778 0.0927
va: 1.2356 2.0250 2.0972 2.1572 1.9946 2.1243 2.9410 3.7456 3.8497 3.8916 4.0449 3.9838 3.9655 4.0853 3.6941 4.0303 4.0392 4.0317 3.8706 3.9142 3.9337 3.9413 3.9539 3.9243 3.9163 1.0160 1.0174 1.0224 1.0240 1.0015 0.9978 0.9942 0.9979 0.9853 0.9857 1.0018 1.0023 0.9985 0.9968 1.0085 1.0130 1.0075 1.0123
dispcorr: -0.021175722 hartree
energy: -1587.878187332902
dipole: -12.47484 11.36844 -1.10641 -12.25726 12.57363 0.31637 10.19096 -9.14184 1.04912
magnitude: 1.55720 au
magnitude: 3.95808 debye
