program: Orca
programVersion: 5.0.2
elementType: Cl O O O O O N C C C C C C C C C C C C C C C C C C H H H H H H H H H H H H H H H H H H
charge: 0
multiplicity: 1
keywords: wb97x-d3
keywords: def2-TZVPP
keywords: def2/J RIJCOSX
keywords: DEFGRID2
keywords: scfconv7
keywords: smallprint printgap noloewdin
keywords: NOSOSCF
formula: C18H18ClNO5
InChI: InChI=1/C18H18ClNO5/c1-4-24-20-17(25-18(21)12-8-6-5-7-9-12)15-14(22-2)11-10-13(19)16(15)23-3/h5-11H,4H2,1-3H3
43 atoms
Cl 4.228963 1.926339 0.975121
O  2.500509 -0.440701 1.254923
O  -0.73338 0.835721 -1.908344
O  -1.175406 -1.081205 0.014725
O  1.933393 -2.262642 -0.758153
O  -1.150932 0.503421 1.602588
N  0.644847 -2.248216 -0.353793
C  0.888075 0.198796 -0.367573
C  2.052903 0.452557 0.354509
C  0.409619 1.152139 -1.275987
C  0.178416 -1.08311 -0.20219
C  2.75169 1.638843 0.131086
C  1.104911 2.338013 -1.471098
C  2.279796 2.567804 -0.773684
C  -3.217918 -0.116523 0.608549
C  -1.750972 -0.169291 0.812488
C  -3.856401 -0.821131 -0.409393
C  -3.966347 0.687073 1.464926
C  2.136059 -0.173898 2.603114
C  -1.3211 1.783176 -2.764894
C  -5.229809 -0.721813 -0.561892
C  -5.338328 0.780609 1.310206
C  -5.972068 0.076626 0.295999
C  2.45453 -3.57843 -0.693176
C  1.858746 -4.510978 -1.727338
H  0.759605 3.086532 -2.169504
H  2.830482 3.483906 -0.936389
H  -3.286281 -1.446479 -1.081304
H  -3.466586 1.236698 2.250704
H  2.58372 -0.961825 3.204176
H  1.053713 -0.190304 2.73247
H  2.519864 0.789053 2.947446
H  -1.556517 2.716102 -2.244802
H  -2.248603 1.340895 -3.119677
H  -0.68656 2.008257 -3.627005
H  -5.722536 -1.271225 -1.352608
H  -5.914955 1.403094 1.980972
H  -7.045078 0.149116 0.175347
H  2.325939 -3.982752 0.314887
H  3.523913 -3.448227 -0.861463
H  2.33494 -5.489704 -1.659747
H  0.789698 -4.645597 -1.570698
H  2.01418 -4.131809 -2.73721
totalener: -1587.85628302 hartree
nucrepener: 2423.25041491 hartree
electener: -4011.10669793 hartree
oneelecener: -6992.16510595 hartree
twoeener: 2981.05840803 hartree
kineticenergy: 1582.62014711 hartree
xcener: -127.813444918070 hartree
chargesum: 0.0000000
charge: -0.076799 -0.325119 -0.298713 -0.236739 -0.181218 -0.362072 -0.085551 -0.124882 0.306388 0.293622 0.253860 -0.053643 -0.234501 -0.121695 -0.022148 0.488195 -0.192152 -0.145720 -0.116654 -0.154278 -0.111315 -0.118020 -0.106767 0.044512 -0.241148 0.111094 0.114418 0.137536 0.137630 0.108284 0.110420 0.089711 0.107876 0.112879 0.110510 0.128943 0.128945 0.130414 0.067561 0.082296 0.073484 0.092398 0.078156
qa: -0.0768 -0.3251 -0.2987 -0.2367 -0.1812 -0.3621 -0.0856 -0.1249 0.3064 0.2936 0.2539 -0.0536 -0.2345 -0.1217 -0.0221 0.4882 -0.1922 -0.1457 -0.1167 -0.1543 -0.1113 -0.1180 -0.1068 0.0445 -0.2411 0.1111 0.1144 0.1375 0.1376 0.1083 0.1104 0.0897 0.1079 0.1129 0.1105 0.1289 0.1289 0.1304 0.0676 0.0823 0.0735 0.0924 0.0782
va: 1.2377 2.0165 2.0926 2.1512 1.9905 2.1336 2.9417 3.7590 3.8362 3.8889 4.0333 3.9917 3.9671 4.0872 3.6626 4.0478 4.0313 4.0356 3.8740 3.9077 3.9278 3.9377 3.9562 3.9228 3.9171 1.0154 1.0175 1.0224 1.0239 0.9944 0.9979 1.0002 0.9860 0.9973 0.9856 1.0014 1.0019 0.9985 1.0082 0.9969 1.0129 1.0128 1.0074
dispcorr: -0.021898244 hartree
energy: -1587.878181264133
dipole: -14.14903 12.85205 -1.29698 -11.16359 11.62925 0.46566 -8.28488 7.45393 -0.83095
magnitude: 1.60918 au
magnitude: 4.09022 debye
