program: Orca
programVersion: 5.0.2
elementType: Cl O O O O O N C C C C C C C C C C C C C C C C C C H H H H H H H H H H H H H H H H H H
charge: 0
multiplicity: 1
keywords: wb97x-d3
keywords: def2-TZVPP
keywords: def2/J RIJCOSX
keywords: DEFGRID2
keywords: scfconv7
keywords: smallprint printgap noloewdin
keywords: NOSOSCF
formula: C18H18ClNO5
InChI: InChI=1/C18H18ClNO5/c1-4-24-20-17(25-18(21)12-8-6-5-7-9-12)15-14(22-2)11-10-13(19)16(15)23-3/h5-11H,4H2,1-3H3
43 atoms
Cl 4.070631 1.577169 -1.891743
O  2.336761 -0.763589 -1.422025
O  -0.525278 1.260315 1.701229
O  -1.168269 -1.036962 0.312818
O  2.012029 -2.053978 1.024347
O  -1.325887 0.235084 -1.528685
N  0.686215 -2.108221 0.773341
C  0.917429 0.264279 0.177543
C  1.991413 0.322626 -0.707495
C  0.540357 1.406104 0.895243
C  0.200147 -1.005942 0.391741
C  2.703819 1.514309 -0.839766
C  1.249484 2.589406 0.741797
C  2.335654 2.63141 -0.117977
C  -3.280647 -0.218389 -0.258186
C  -1.835977 -0.293152 -0.581189
C  -4.10303 0.498864 -1.123684
C  -3.829491 -0.828262 0.867524
C  1.821363 -0.805848 -2.746277
C  -1.002173 2.376871 2.410279
C  -5.458937 0.603628 -0.868481
C  -5.188276 -0.723646 1.116358
C  -6.003953 -0.009184 0.25118
C  2.50707 -3.350999 1.307454
C  2.049461 -3.881483 2.650664
H  0.983429 3.482302 1.288709
H  2.897646 3.548367 -0.22817
H  -3.673104 0.97169 -1.996227
H  -3.20208 -1.385973 1.548008
H  2.154182 -1.748192 -3.175646
H  2.20466 0.012847 -3.359652
H  0.731605 -0.77245 -2.750872
H  -0.265715 2.754312 3.125924
H  -1.87995 2.040501 2.956527
H  -1.298103 3.191298 1.742396
H  -6.092374 1.161743 -1.544839
H  -5.611565 -1.202256 1.989258
H  -7.064891 0.069288 0.44911
H  3.591107 -3.233774 1.28663
H  2.233054 -4.040993 0.503973
H  2.350717 -3.217938 3.461488
H  0.966477 -3.995343 2.682958
H  2.495727 -4.859621 2.834324
totalener: -1587.85631373 hartree
nucrepener: 2421.86776531 hartree
electener: -4009.72407904 hartree
oneelecener: -6989.43352306 hartree
twoeener: 2979.70944402 hartree
kineticenergy: 1582.61814694 hartree
xcener: -127.813081033059 hartree
chargesum: 0.0000000
charge: -0.077378 -0.323811 -0.298488 -0.235919 -0.179710 -0.361887 -0.087959 -0.130320 0.305972 0.298784 0.257782 -0.052714 -0.236885 -0.120510 -0.030053 0.486488 -0.143677 -0.182044 -0.118118 -0.156859 -0.119096 -0.113906 -0.105789 0.044584 -0.244039 0.112110 0.114291 0.137523 0.137632 0.108323 0.090997 0.109624 0.109833 0.115651 0.106504 0.128998 0.128431 0.130524 0.083047 0.067296 0.078280 0.092164 0.074322
qa: -0.0774 -0.3238 -0.2985 -0.2359 -0.1797 -0.3619 -0.0880 -0.1303 0.3060 0.2988 0.2578 -0.0527 -0.2369 -0.1205 -0.0301 0.4865 -0.1437 -0.1820 -0.1181 -0.1569 -0.1191 -0.1139 -0.1058 0.0446 -0.2440 0.1121 0.1143 0.1375 0.1376 0.1083 0.0910 0.1096 0.1098 0.1157 0.1065 0.1290 0.1284 0.1305 0.0830 0.0673 0.0783 0.0922 0.0743
va: 1.2371 2.0204 2.0926 2.1539 1.9948 2.1335 2.9402 3.7700 3.8359 3.8845 4.0230 3.9904 3.9716 4.0893 3.6734 4.0463 4.0321 4.0322 3.8743 3.9096 3.9375 3.9315 3.9545 3.9222 3.9174 1.0150 1.0175 1.0242 1.0215 0.9945 1.0005 0.9970 0.9857 0.9967 0.9858 1.0019 1.0017 0.9984 0.9970 1.0092 1.0073 1.0120 1.0133
dispcorr: -0.021717279 hartree
energy: -1587.878031007578
dipole: -13.13127 11.92214 -1.20913 -8.70297 9.30654 0.60356 12.73693 -11.86391 0.87302
magnitude: 1.60887 au
magnitude: 4.08941 debye
