program: Gaussian 09
title: 000053612
version: EM64L-G09RevD.01
frameworkgroup: C1[X(C17H14N2O)]
method: RPBEPBE
basis: SDD
operation: Freq
keyword: #p
keyword: freq=noraman
keyword: PBEPBE/SDD
title: #p freq=noraman PBEPBE/SDD
converged: YES YES NO NO
title: Mulliken charges:
elementType: O N N C C C C C C C C C C C C C C C C C H H H H H H H H H H H H H H
charge: -0.164544 -0.102519 -0.096775 0.213814 0.236270 -0.487763 0.072547 0.337727 -0.375160 -0.388476 -0.247760 -0.229440 -0.395390 -0.402062 -0.146530 -0.209288 -0.221541 -0.228324 -0.240389 -0.328529 0.243060 0.263683 0.226724 0.258817 0.239147 0.236984 0.223796 0.245166 0.274983 0.252285 0.228332 0.228464 0.250793 0.231898
chargesum: 0.00000
title: Mulliken charges with hydrogens summed into heavy atoms:
elementType: O N N C C C C C C C C C C C C C C C C C
charge: -0.164544 -0.102519 -0.096775 0.213814 0.236270 0.018981 0.072547 0.337727 -0.148435 -0.129659 -0.008613 0.007544 -0.171594 -0.156896 0.128453 0.042996 0.006792 0.000140 -0.008491 -0.077737
polarizability: 2.24266719e+02 -3.50782772e+00 2.47890182e+02 -9.67380202e+00 3.07135205e+00 1.11820846e+02
1716.lowfreq: -5.7440 -1.4329 -0.0007 -0.0006 -0.0004 8.4296 13.0598 25.8578 44.7988
frequency: 12.4999 25.7939 44.7987 57.6067 76.5075 77.8365 108.6966 134.3286 181.9125 218.2902 257.5274 282.9022 295.9818 316.7406 366.7300 384.6634 405.6480 507.3405 508.5941 548.3498 564.4835 611.8511 612.9246 616.8570 637.1112 651.1455 700.5775 704.4700 724.3527 746.1920 750.7844 762.6995 767.6103 780.2029 815.7336 843.6814 851.2815 877.8397 882.8761 919.9126 932.1343 955.0228 972.4757 975.2306 988.7693 994.6499 995.3524 996.3726 1009.4968 1034.5004 1053.0223 1056.4516 1081.8380 1108.4409 1122.1430 1168.0040 1173.8772 1183.5817 1189.8859 1211.0899 1226.5122 1261.0110 1269.3536 1291.8824 1304.4599 1313.6910 1348.5795 1362.1863 1366.1868 1373.8463 1422.7429 1427.1251 1437.4458 1458.5870 1465.0762 1479.9633 1494.1161 1566.7009 1585.7880 1600.0464 1612.6108 1615.5045 2964.4102 3068.5025 3117.4454 3127.1128 3130.2314 3136.8033 3138.7252 3149.2136 3150.9156 3166.3180 3168.4640 3223.3630 3230.5100 3264.3593
redmass: 5.2041 4.7205 4.0185 4.5165 4.4411 5.3857 5.0641 5.6661 4.9972 5.8632 4.4829 4.8729 5.4089 3.0159 4.6734 3.6092 2.8543 4.6006 3.9080 3.1039 3.1266 6.2201 3.2744 6.3951 5.7192 3.3515 4.2702 1.9029 1.3234 2.8864 1.8520 1.5536 2.3724 1.8923 4.5589 1.4400 1.2474 6.3046 1.4049 1.4141 2.7571 1.4946 2.5818 1.7338 5.2306 2.4524 1.3399 2.0559 3.6131 2.1085 2.0507 1.7467 1.6098 1.7857 1.7086 1.4126 1.0524 1.1167 1.1118 2.8045 1.5464 1.7071 1.9596 2.0912 1.7824 1.3979 4.0593 4.2246 3.5369 6.7215 2.1113 1.4966 2.3005 1.9461 2.2648 3.7387 2.8258 6.1307 6.1470 6.0724 6.2428 10.1410 1.0687 1.0900 1.0869 1.0861 1.0854 1.0893 1.0912 1.0960 1.0944 1.1016 1.1009 1.0969 1.0933 1.1080
irintensity: 0.9806 1.3106 0.1637 5.3950 0.7020 3.2470 0.4175 3.1229 1.2143 0.4452 0.3043 3.3813 0.6968 1.0513 1.3423 3.4245 0.4785 7.2041 5.1255 9.0627 2.0690 3.3876 9.8373 1.1491 30.7427 15.7610 12.9175 36.3770 9.8223 31.2601 27.1392 86.0011 54.0014 27.8025 3.4418 4.1345 1.0247 14.3887 0.2075 2.1637 11.7977 9.9345 21.6635 7.4890 0.8030 3.7531 0.5736 5.0680 38.6442 1.5016 3.3107 31.5865 7.8854 14.2323 8.0191 6.1221 0.0049 0.4991 0.6666 149.8414 1.9269 15.3428 16.8489 2.7743 22.3719 0.2246 7.1780 3.4711 4.7983 0.1984 5.3242 39.3450 8.1611 38.7319 39.2630 16.7094 3.8964 18.0707 3.5317 13.4459 2.7280 90.6209 42.8214 4.3018 11.1495 1.8299 4.9402 6.4467 13.5618 26.6752 27.1431 28.6149 19.2469 2.9233 4.1141 1.0093
temp: 298.150 k
press: 1.00000 atm
elementType: 8 7 7 6 6 6 6 6 6 6 6 6 6 6 6 6 6 6 6 6 1 1 1 1 1 1 1 1 1 1 1 1 1 1
symmnumber: 1
zpe: 694775.9 jmol-1
zpe.correction: 0.264626 hartree
zpe.thermalcorrener: 0.281182 hartree
zpe.thermalcorrenthalpy: 0.282126 hartree
zpe.thermalcorrgfe: 0.217135 hartree
zpe.sumelectzpe: -839.531589 hartree
zpe.sumelectthermal: -839.515033 hartree
zpe.sumelectthermalent: -839.514089 hartree
zpe.sumelectthermalfe: -839.579080 hartree
dipole: 5.6839 2.4760 2.8170
dipole: 6.8097
quadrupole: -138.7575 -94.4603 -119.8383
quadrupole: -3.1318 -9.3996 -1.2038
quadrupole: -21.0721 23.2250 -2.1529 -3.1318 -9.3996 -1.2038
hfenergy: -839.796215 hartree
pointgroup: C01 [X(C17H14N2O1)]
dipole: -2.4386375 0.6233462 -0.9178111 debye
polarizability: 222.8071834|0.1554135|246.9767846|-14.0787563|14.184198|114.1937793 unknown
InChI: InChI=1S/C17H14N2O/c20-17(12-19-11-10-18-13-19)16-9-5-4-8-15(16)14-6-2-1-3-7-14/h1-11,13H,12H2
charge 0 multiplicity 1
34 atoms
O  0.865579 -0.432242 0.986261
N  3.131592 0.711126 -0.320032
N  5.332212 0.85119 0.223609
C  -0.667161 1.280106 0.216381
C  -1.894681 0.540969 0.175497
C  1.778287 1.144422 -0.650662
C  0.66742 0.580382 0.268897
C  -1.951625 -0.930672 -0.080292
C  -0.70184 2.694152 0.355072
C  -3.112751 1.255394 0.314877
C  -1.924027 3.383896 0.494268
C  -3.134971 2.656895 0.481949
C  -1.271342 -1.506667 -1.185922
C  -2.74503 -1.772525 0.742209
C  3.620885 -0.603675 -0.290873
C  4.20576 1.550096 -0.001396
C  -1.367247 -2.88827 -1.452985
C  -2.838492 -3.15642 0.479471
C  -2.149539 -3.720553 -0.618723
C  4.972012 -0.496807 0.043258
H  1.754226 2.24715 -0.655686
H  1.510382 0.830623 -1.682157
H  0.234063 3.260809 0.415508
H  -4.055112 0.699603 0.259696
H  -1.929425 4.471394 0.62095
H  -4.09228 3.178697 0.587456
H  -0.685472 -0.864134 -1.854827
H  -3.260828 -1.345621 1.610055
H  2.9771 -1.461946 -0.456083
H  4.110874 2.633321 0.043128
H  -0.840023 -3.314396 -2.313813
H  -3.441465 -3.794244 1.135182
H  5.698863 -1.294859 0.1736
H  -2.221444 -4.794495 -0.822771
