program: Orca
programVersion: 5.0.3
elementType: Cl Cl S F F F O N N N N C C C C C C C C C C C C C H H H H H H H H H
charge: 0
multiplicity: 1
keywords: wb97x-d3
keywords: def2-TZVPP
keywords: def2/J RIJCOSX
keywords: DEFGRID2
keywords: scfconv7
keywords: smallprint printgap noloewdin
keywords: NOSOSCF
formula: C13H9Cl2F3N4OS
InChI: InChI=1/C13H9Cl2F3N4OS/c1-2-24(23)11-9(5-19)21-22(12(11)20)10-7(14)3-6(4-8(10)15)13(16,17)18/h3-4H,2,20H2,1H3
33 atoms
Cl -0.489896 2.349201 1.154233
Cl -0.660833 -2.085556 -1.845057
S  4.406988 -0.421299 0.287023
F  -5.49774 0.99543 0.704238
F  -5.593371 -0.474216 -0.862526
F  -5.221652 -1.087551 1.164223
O  4.284149 -1.733171 1.039422
N  0.648133 0.200862 -0.516948
N  1.156314 0.766859 -1.626028
N  1.30222 -0.855895 1.511656
N  4.104706 1.498377 -3.25262
C  1.590155 -0.284108 0.331666
C  2.804689 0.000228 -0.275851
C  -0.743236 0.130975 -0.333983
C  2.452226 0.63695 -1.481522
C  -1.397881 1.08099 0.438979
C  -1.476274 -0.901095 -0.909731
C  -3.475569 -0.013906 0.039507
C  4.603288 0.864032 1.556682
C  -2.766819 1.017338 0.63358
C  -2.843956 -0.979492 -0.731628
C  5.886827 0.635212 2.32722
C  -4.955168 -0.137688 0.261226
C  3.350788 1.118391 -2.468716
H  4.612258 1.816406 1.023781
H  3.726896 0.836874 2.206582
H  -3.25553 1.767447 1.239005
H  -3.39835 -1.788949 -1.187033
H  2.044111 -1.393868 1.933234
H  0.375097 -1.230128 1.652689
H  5.869037 -0.311481 2.86465
H  6.760939 0.648817 1.675665
H  6.010468 1.429186 3.062911
elementType: Cl S F O N C H
totalener: -2413.28054622 hartree
nucrepener: 2576.95119616 hartree
electener: -4990.23174238 hartree
oneelecener: -8445.35225515 hartree
twoeener: 3455.12051277 hartree
cpcmener: -0.04298324 hartree
kineticenergy: 2407.10804742 hartree
xcener: -159.937523542725 hartree
chargesum: 0.0000000
charge: -0.030549 -0.030229 0.490166 -0.173637 -0.176425 -0.174247 -0.687445 0.114292 -0.294323 -0.278452 -0.085689 0.147578 -0.086949 0.042617 0.283794 0.012968 -0.000655 -0.034825 -0.129066 -0.062915 -0.081735 -0.257381 0.552556 -0.260228 0.119221 0.119547 0.138837 0.135391 0.201155 0.199594 0.091523 0.094812 0.100699
qa: -0.0305 -0.0302 0.4902 -0.1736 -0.1764 -0.1742 -0.6874 0.1143 -0.2943 -0.2785 -0.0857 0.1476 -0.0869 0.0426 0.2838 0.0130 -0.0007 -0.0348 -0.1291 -0.0629 -0.0817 -0.2574 0.5526 -0.2602 0.1192 0.1195 0.1388 0.1354 0.2012 0.1996 0.0915 0.0948 0.1007
va: 1.2903 1.2897 3.5929 1.1348 1.1291 1.1221 1.6906 3.2781 2.8422 3.2260 3.1244 4.1730 3.7345 3.6161 3.9532 4.0532 4.0671 3.7712 3.8823 4.0020 4.0470 3.9349 4.4166 4.1211 1.0155 1.0141 1.0232 1.0255 1.0242 0.9990 1.0191 1.0020 1.0023
dispcorr: -0.019162948 hartree
energy: -2413.299709170888
dipole: 37.82686 -40.01062 -2.18376 1.68241 -1.41657 0.26585 13.75866 -10.92188 2.83678
magnitude: 3.58982 au
magnitude: 9.12460 debye
