program: Orca
programVersion: 5.0.3
elementType: Cl Cl S F F F O N N N N C C C C C C C C C C C C C H H H H H H H H H
charge: 0
multiplicity: 1
keywords: wb97x-d3
keywords: def2-TZVPP
keywords: def2/J RIJCOSX
keywords: DEFGRID2
keywords: scfconv7
keywords: smallprint printgap noloewdin
keywords: NOSOSCF
formula: C13H9Cl2F3N4OS
InChI: InChI=1/C13H9Cl2F3N4OS/c1-2-24(23)11-9(5-19)21-22(12(11)20)10-7(14)3-6(4-8(10)15)13(16,17)18/h3-4H,2,20H2,1H3
33 atoms
Cl -0.417543 2.311521 1.168473
Cl -0.681693 -2.049259 -1.931114
S  4.424702 -0.639322 0.133714
F  -5.532968 -0.950855 -0.474963
F  -5.142411 -0.500157 1.592334
F  -5.518887 1.088865 0.198834
O  4.301461 -2.015649 0.759166
N  0.675589 0.169523 -0.553176
N  1.189606 0.794047 -1.628852
N  1.306387 -1.159727 1.310194
N  4.128481 1.491506 -3.280399
C  1.608579 -0.429428 0.231267
C  2.824539 -0.156664 -0.382449
C  -0.715132 0.124249 -0.359864
C  2.47911 0.584969 -1.528488
C  -1.350322 1.066856 0.441873
C  -1.467795 -0.883149 -0.948618
C  -3.44366 -0.009071 0.05827
C  4.623065 0.521347 1.518951
C  -2.713984 1.008655 0.657733
C  -2.835107 -0.956649 -0.74835
C  5.915812 0.237691 2.254219
C  -4.917321 -0.094377 0.338226
C  3.377834 1.088748 -2.504723
H  4.615304 1.520748 1.080579
H  3.754499 0.422247 2.172879
H  -3.189825 1.747979 1.288151
H  -3.398979 -1.751044 -1.215732
H  2.062207 -1.504748 1.878409
H  0.409637 -1.066713 1.761441
H  6.784524 0.336534 1.603031
H  6.029925 0.953017 3.068019
H  5.919427 -0.760245 2.689632
elementType: Cl S F O N C H
totalener: -2413.27985871 hartree
nucrepener: 2576.78598330 hartree
electener: -4990.06584202 hartree
oneelecener: -8445.00146257 hartree
twoeener: 3454.93562055 hartree
cpcmener: -0.04703517 hartree
kineticenergy: 2407.10043792 hartree
xcener: -159.937415143813 hartree
chargesum: 0.0000000
charge: -0.031186 -0.029786 0.486053 -0.173481 -0.174825 -0.176220 -0.689044 0.119476 -0.295800 -0.244949 -0.086283 0.118469 -0.079767 0.049117 0.283232 0.000760 -0.003542 -0.043529 -0.128618 -0.078364 -0.055171 -0.259372 0.554176 -0.260796 0.119231 0.121525 0.138642 0.137726 0.191579 0.202838 0.095139 0.101256 0.091512
qa: -0.0312 -0.0298 0.4861 -0.1735 -0.1748 -0.1762 -0.6890 0.1195 -0.2958 -0.2449 -0.0863 0.1185 -0.0798 0.0491 0.2832 0.0008 -0.0035 -0.0435 -0.1286 -0.0784 -0.0552 -0.2594 0.5542 -0.2608 0.1192 0.1215 0.1386 0.1377 0.1916 0.2028 0.0951 0.1013 0.0915
va: 1.2889 1.2915 3.6010 1.1344 1.1230 1.1288 1.6860 3.2675 2.8386 3.2675 3.1244 4.2332 3.7340 3.6212 3.9486 4.0391 4.0795 3.7803 3.8810 4.0456 3.9849 3.9361 4.4175 4.1227 1.0155 1.0108 1.0234 1.0239 1.0262 0.9970 1.0023 1.0018 1.0187
dispcorr: -0.019213221 hartree
energy: -2413.299071935785
dipole: 37.79463 -39.98622 -2.19159 -0.06371 0.64346 0.57976 13.53763 -10.20831 3.32932
magnitude: 4.02785 au
magnitude: 10.23798 debye
