program: Orca
programVersion: 5.0.3
elementType: Cl Cl S F F F O N N N N C C C C C C C C C C C C C H H H H H H H H H
charge: 0
multiplicity: 1
keywords: wb97x-d3
keywords: def2-TZVPP
keywords: def2/J RIJCOSX
keywords: DEFGRID2
keywords: scfconv7
keywords: smallprint printgap noloewdin
keywords: NOSOSCF
formula: C13H9Cl2F3N4OS
InChI: InChI=1/C13H9Cl2F3N4OS/c1-2-24(23)11-9(5-19)21-22(12(11)20)10-7(14)3-6(4-8(10)15)13(16,17)18/h3-4H,2,20H2,1H3
33 atoms
Cl -0.34466 1.906654 1.684181
Cl -0.740501 -1.634964 -2.325906
S  4.433834 -0.67907 0.202698
F  -5.24135 -1.155876 0.991833
F  -5.398416 0.988174 0.944445
F  -5.584188 -0.141163 -0.874218
O  4.18398 -1.909325 1.050837
N  0.69358 0.180171 -0.479603
N  1.21507 0.907728 -1.479756
N  1.320796 -1.201612 1.356778
N  4.177709 1.826263 -2.981249
C  1.626141 -0.454732 0.27928
C  2.846554 -0.090728 -0.268039
C  -0.698318 0.128348 -0.299281
C  2.508743 0.737637 -1.357589
C  -1.30454 0.878209 0.701241
C  -1.48676 -0.68467 -1.107444
C  -3.43876 0.022832 0.068983
C  4.929548 0.656911 1.33341
C  -2.673773 0.830424 0.894556
C  -2.857258 -0.740196 -0.933723
C  4.029511 0.816568 2.536742
C  -4.923133 -0.066976 0.282793
C  3.415053 1.349761 -2.264161
H  5.953415 0.4116 1.626067
H  4.974238 1.56166 0.722108
H  -3.121097 1.424146 1.679185
H  -3.451334 -1.375119 -1.577027
H  2.083206 -1.771825 1.696828
H  0.41905 -1.655691 1.378682
H  3.974181 -0.098579 3.124149
H  4.435141 1.595828 3.182675
H  3.020429 1.118089 2.257311
elementType: Cl S F O N C H
totalener: -2413.28683219 hartree
nucrepener: 2601.11620610 hartree
electener: -5014.40303829 hartree
oneelecener: -8493.85796625 hartree
twoeener: 3479.45492795 hartree
cpcmener: -0.03332230 hartree
kineticenergy: 2407.10525164 hartree
xcener: -159.937776029987 hartree
chargesum: -0.0000000
charge: -0.030956 -0.028307 0.496988 -0.173348 -0.173752 -0.174596 -0.664690 0.119738 -0.292076 -0.288928 -0.071968 0.127760 -0.098750 0.056617 0.289106 0.007806 0.000065 -0.039270 -0.104709 -0.068512 -0.090776 -0.276989 0.551781 -0.277266 0.123707 0.112687 0.137249 0.135318 0.210162 0.193268 0.092624 0.113286 0.086731
qa: -0.0310 -0.0283 0.4970 -0.1733 -0.1738 -0.1746 -0.6647 0.1197 -0.2921 -0.2889 -0.0720 0.1278 -0.0987 0.0566 0.2891 0.0078 0.0001 -0.0393 -0.1047 -0.0685 -0.0908 -0.2770 0.5518 -0.2773 0.1237 0.1127 0.1372 0.1353 0.2102 0.1933 0.0926 0.1133 0.0867
va: 1.2905 1.2906 3.6010 1.1225 1.1336 1.1314 1.7252 3.2743 2.8520 3.1897 3.1271 4.1668 3.7293 3.5997 3.9340 4.0443 4.0630 3.7756 3.8466 4.0116 4.0451 3.9435 4.4160 4.1184 1.0065 1.0189 1.0241 1.0257 1.0222 1.0009 1.0166 1.0034 0.9999
dispcorr: -0.020266753 hartree
energy: -2413.307098939965
dipole: 33.55726 -35.31591 -1.75865 0.92760 -1.13932 -0.21172 13.21292 -10.96469 2.24824
magnitude: 2.86221 au
magnitude: 7.27516 debye
