program: Orca
programVersion: 5.0.3
elementType: Cl Cl S F F F O N N N N C C C C C C C C C C C C C H H H H H H H H H
charge: 0
multiplicity: 1
keywords: wb97x-d3
keywords: def2-TZVPP
keywords: def2/J RIJCOSX
keywords: DEFGRID2
keywords: scfconv7
keywords: smallprint printgap noloewdin
keywords: NOSOSCF
formula: C13H9Cl2F3N4OS
InChI: InChI=1/C13H9Cl2F3N4OS/c1-2-24(23)11-9(5-19)21-22(12(11)20)10-7(14)3-6(4-8(10)15)13(16,17)18/h3-4H,2,20H2,1H3
33 atoms
Cl -0.529212 2.341933 1.131487
Cl -0.676893 -2.173631 -1.753992
S  4.363306 -0.77365 0.207783
F  -5.551528 -1.186309 -0.240667
F  -5.319951 0.051943 1.503062
F  -5.588449 0.955022 -0.428376
O  4.114567 -2.034969 1.008441
N  0.629734 0.136602 -0.449925
N  1.16244 0.951216 -1.375016
N  1.224329 -1.461842 1.200872
N  4.125461 2.002374 -2.768165
C  1.553136 -0.56028 0.265165
C  2.779447 -0.16795 -0.251924
C  -0.764661 0.077907 -0.293999
C  2.453417 0.753039 -1.268188
C  -1.431735 1.063549 0.427413
C  -1.494121 -0.963519 -0.852884
C  -3.509518 -0.03573 0.020863
C  4.822368 0.502454 1.417194
C  -2.803059 1.019047 0.58394
C  -2.869331 -1.031294 -0.697186
C  6.158857 0.15584 2.042441
C  -4.999585 -0.06143 0.21036
C  3.365224 1.449502 -2.105636
H  4.864369 1.446791 0.871267
H  4.023977 0.562604 2.158353
H  -3.304235 1.796584 1.144974
H  -3.414998 -1.85312 -1.138826
H  1.983985 -1.871052 1.721984
H  0.338313 -1.392596 1.676413
H  6.949499 0.081363 1.296436
H  6.444357 0.936205 2.746019
H  6.115251 -0.781959 2.592767
elementType: Cl S F O N C H
totalener: -2413.28593270 hartree
nucrepener: 2573.93484549 hartree
electener: -4987.22077820 hartree
oneelecener: -8439.63116373 hartree
twoeener: 3452.41038553 hartree
cpcmener: -0.03494518 hartree
kineticenergy: 2407.11162378 hartree
xcener: -159.938176518021 hartree
chargesum: 0.0000000
charge: -0.029661 -0.027228 0.501624 -0.172633 -0.175984 -0.174442 -0.665159 0.121795 -0.295429 -0.279327 -0.072927 0.140381 -0.090301 0.044805 0.284865 0.004510 0.007838 -0.045497 -0.135883 -0.097641 -0.058138 -0.256858 0.556705 -0.279595 0.114567 0.119826 0.135011 0.138807 0.198745 0.199180 0.095149 0.099590 0.093304
qa: -0.0297 -0.0272 0.5016 -0.1726 -0.1760 -0.1744 -0.6652 0.1218 -0.2954 -0.2793 -0.0729 0.1404 -0.0903 0.0448 0.2849 0.0045 0.0078 -0.0455 -0.1359 -0.0976 -0.0581 -0.2569 0.5567 -0.2796 0.1146 0.1198 0.1350 0.1388 0.1987 0.1992 0.0951 0.0996 0.0933
va: 1.2905 1.2930 3.5948 1.1364 1.1276 1.1263 1.7250 3.2629 2.8437 3.2250 3.1267 4.1999 3.7418 3.6164 3.9381 4.0564 4.0524 3.7804 3.8993 4.0589 3.9805 3.9277 4.4162 4.1138 1.0146 1.0104 1.0264 1.0229 1.0309 0.9973 1.0034 1.0024 1.0189
dispcorr: -0.018986207 hartree
energy: -2413.304918910162
dipole: 39.25751 -40.97154 -1.71403 -1.01724 0.97770 -0.03954 12.49344 -9.88096 2.61248
magnitude: 3.12482 au
magnitude: 7.94267 debye
