program: Orca
programVersion: 5.0.3
elementType: Cl Cl S F F F O N N N N C C C C C C C C C C C C C H H H H H H H H H
charge: 0
multiplicity: 1
keywords: wb97x-d3
keywords: def2-TZVPP
keywords: def2/J RIJCOSX
keywords: DEFGRID2
keywords: scfconv7
keywords: smallprint printgap noloewdin
keywords: NOSOSCF
formula: C13H9Cl2F3N4OS
InChI: InChI=1/C13H9Cl2F3N4OS/c1-2-24(23)11-9(5-19)21-22(12(11)20)10-7(14)3-6(4-8(10)15)13(16,17)18/h3-4H,2,20H2,1H3
33 atoms
Cl -0.529524 1.690443 1.905001
Cl -0.755291 -1.480234 -2.420356
S  4.320181 -0.724538 0.391915
F  -5.364436 -1.211739 0.836982
F  -5.558254 0.929174 0.767018
F  -5.653558 -0.219485 -1.050665
O  4.022394 -1.666668 1.531105
N  0.606223 0.178974 -0.385755
N  1.149265 0.935121 -1.352418
N  1.190456 -1.37849 1.330978
N  4.197477 1.881942 -2.712747
C  1.523382 -0.494744 0.362185
C  2.749967 -0.141238 -0.167183
C  -0.789296 0.111467 -0.258446
C  2.437937 0.732177 -1.23198
C  -1.444161 0.778992 0.771082
C  -1.543368 -0.629691 -1.164643
C  -3.552886 -0.010698 -0.022609
C  4.897804 0.824307 1.164791
C  -2.821194 0.721336 0.898514
C  -2.922157 -0.687174 -1.055773
C  6.206669 0.568843 1.887478
C  -5.045075 -0.123701 0.131069
C  3.379825 1.379511 -2.077915
H  5.010487 1.559086 0.364827
H  4.112209 1.158905 1.843688
H  -3.302749 1.256155 1.704333
H  -3.485205 -1.261722 -1.777596
H  1.997754 -1.750742 1.81611
H  0.39968 -1.165495 1.914651
H  6.084219 -0.181363 2.666643
H  6.98574 0.230954 1.203983
H  6.555879 1.487412 2.357273
totalener: -2413.26133833 hartree
nucrepener: 2575.33213140 hartree
electener: -4988.59346973 hartree
oneelecener: -8442.86653480 hartree
twoeener: 3454.27306507 hartree
kineticenergy: 2407.14765990 hartree
xcener: -159.939659541253 hartree
chargesum: 0.0000000
charge: -0.018494 -0.002972 0.515171 -0.159988 -0.165610 -0.164111 -0.592047 0.115743 -0.261607 -0.281243 0.003120 0.145276 -0.132896 0.097388 0.274617 -0.055300 -0.008977 -0.060024 -0.166101 -0.071650 -0.099504 -0.253076 0.540488 -0.311259 0.107319 0.107975 0.131456 0.126761 0.198590 0.153860 0.106089 0.090395 0.090613
qa: -0.0185 -0.0030 0.5152 -0.1600 -0.1656 -0.1641 -0.5920 0.1157 -0.2616 -0.2812 0.0031 0.1453 -0.1329 0.0974 0.2746 -0.0553 -0.0090 -0.0600 -0.1661 -0.0716 -0.0995 -0.2531 0.5405 -0.3113 0.1073 0.1080 0.1315 0.1268 0.1986 0.1539 0.1061 0.0904 0.0906
va: 1.3040 1.3163 3.6172 1.1394 1.1435 1.1454 1.8127 3.2607 2.8335 3.1603 3.1296 4.1557 3.7759 3.6225 3.8921 4.0365 4.1167 3.8371 3.9199 4.0042 4.0483 3.9328 4.4316 4.0806 1.0219 1.0122 1.0279 1.0309 1.0463 1.0294 1.0183 1.0060 1.0024
dispcorr: -0.018900784 hartree
energy: -2413.280239109598
dipole: 39.87898 -40.90764 -1.02866 1.37579 -1.33435 0.04144 11.60494 -10.13232 1.47263
magnitude: 1.79680 au
magnitude: 4.56710 debye
