program: Orca
programVersion: 5.0.3
elementType: Cl Cl Cl Cl Cl Cl S O O O C C C C C C C C C H H H H H H
charge: 0
multiplicity: 1
keywords: wb97x-d3
keywords: def2-TZVPP
keywords: def2/J RIJCOSX
keywords: DEFGRID2
keywords: scfconv7
keywords: smallprint printgap noloewdin
keywords: NOSOSCF
formula: C9H6Cl6O3S
InChI: InChI=1/C9H6Cl6O3S/c10-5-6(11)8(13)4-2-18-19(16)17-1-3(4)7(5,12)9(8,14)15/h3-4H,1-2H2
25 atoms
Cl 1.310898 2.744994 0.467826
Cl 1.310007 -2.745649 0.466933
Cl 3.258941 -0.000576 0.039369
Cl 1.8513 -0.000755 2.514669
Cl 0.440728 1.714831 -2.516398
Cl 0.440071 -1.714268 -2.516916
S  -3.952158 0.000441 0.699572
O  -2.974687 1.250433 1.067129
O  -2.975102 -1.250014 1.066662
O  -4.139908 0.000742 -0.755321
C  -0.607888 0.781232 0.939944
C  -0.608154 -0.781418 0.939681
C  0.732521 1.113923 0.234629
C  0.732154 -1.114317 0.234274
C  1.656284 -0.000433 0.767893
C  0.618849 0.664327 -1.20829
C  0.618617 -0.664229 -1.208497
C  -1.789006 1.480806 0.290272
C  -1.789477 -1.480381 0.289718
H  -0.547455 1.132354 1.971198
H  -0.547864 -1.132905 1.970819
H  -1.636364 2.559535 0.306186
H  -1.946445 1.190374 -0.750604
H  -1.946833 -1.189443 -0.751031
H  -1.637144 -2.559159 0.305165
elementType: Cl S O C H
totalener: -3731.72615887 hartree
nucrepener: 2870.06184654 hartree
electener: -6601.78800541 hartree
twoeener: 4260.88102913 hartree
cpcmener: -0.01688102 hartree
kineticenergy: 3724.70519649 hartree
xcener: -198.706025071215 hartree
chargesum: 0.0000000
charge: -0.043568 -0.043566 -0.045274 -0.043589 0.014370 0.014357 0.698929 -0.325088 -0.325094 -0.535337 -0.033833 -0.033861 0.206597 0.206683 0.028753 -0.189261 -0.189276 -0.071437 -0.071403 0.122886 0.122827 0.129567 0.138026 0.138021 0.129573
qa: -0.0436 -0.0436 -0.0453 -0.0436 0.0144 0.0144 0.6989 -0.3251 -0.3251 -0.5353 -0.0338 -0.0339 0.2066 0.2067 0.0288 -0.1893 -0.1893 -0.0714 -0.0714 0.1229 0.1228 0.1296 0.1380 0.1380 0.1296
va: 1.3077 1.3078 1.2844 1.2995 1.3637 1.3637 4.0189 2.0075 2.0075 1.9055 3.7970 3.7970 4.0503 4.0501 4.7593 4.0691 4.0690 3.9175 3.9174 1.0407 1.0407 1.0159 1.0069 1.0069 1.0159
dispcorr: -0.021011813 hartree
energy: -3731.747170678886
dipole: -19.32370 19.61366 0.28997 0.00249 -0.00258 -0.00009 4.98463 -4.45405 0.53057
magnitude: 0.60464 au
magnitude: 1.53687 debye
