program: Orca
programVersion: 5.0.3
elementType: Cl Cl Cl Cl Cl Cl Cl Cl C C C C C C C C C C H H H H H H
charge: 0
multiplicity: 1
keywords: wb97x-d3
keywords: def2-TZVPP
keywords: def2/J RIJCOSX
keywords: DEFGRID2
keywords: scfconv7
keywords: smallprint printgap noloewdin
keywords: NOSOSCF
formula: C10H6Cl8
InChI: InChI=1/C10H6Cl8/c11-3-1-2-4(5(3)12)9(16)7(14)6(13)8(2,15)10(9,17)18/h2-5H,1H2
24 atoms
Cl 0.215045 -2.680683 0.463264
Cl 1.032564 2.758045 0.757972
Cl 1.915468 -0.266125 2.147763
Cl -0.844376 0.262043 2.127206
Cl -2.865233 -1.376691 0.370929
Cl -4.373531 0.927504 -1.185781
Cl 2.650653 -1.904176 -1.559758
Cl 3.186567 1.488626 -1.38281
C  -0.594149 -0.469645 -1.076688
C  -0.378659 1.073504 -0.945407
C  0.425674 -1.031249 -0.043513
C  0.782345 1.176424 0.073391
C  0.533999 0.033778 1.079956
C  -2.118679 -0.71293 -1.091288
C  -1.760985 1.665895 -0.671536
C  -2.639298 0.69103 -1.441493
C  1.7562 -0.736513 -0.735274
C  1.962917 0.573615 -0.670297
H  -0.248685 -0.819835 -2.05099
H  -0.012833 1.489982 -1.886453
H  -2.369093 -1.421113 -1.878688
H  -2.034901 1.671027 0.379498
H  -1.854361 2.682936 -1.047839
H  -2.470206 0.828223 -2.51355
totalener: -4066.35170230 hartree
nucrepener: 2816.75932636 hartree
electener: -6883.11102866 hartree
twoeener: 4338.04578894 hartree
kineticenergy: 4059.55549266 hartree
xcener: -207.123762489871 hartree
chargesum: 0.0000000
charge: -0.017087 -0.034505 -0.042922 -0.020229 -0.089177 -0.097439 0.009121 0.009482 -0.252468 -0.149262 0.247844 0.245640 -0.052012 0.008517 -0.234124 0.040296 -0.133861 -0.124918 0.120244 0.109104 0.124053 0.116895 0.108129 0.108678
qa: -0.0171 -0.0345 -0.0429 -0.0202 -0.0892 -0.0974 0.0091 0.0095 -0.2525 -0.1493 0.2478 0.2456 -0.0520 0.0085 -0.2341 0.0403 -0.1339 -0.1249 0.1202 0.1091 0.1241 0.1169 0.1081 0.1087
va: 1.3269 1.3127 1.2774 1.3148 1.2293 1.2245 1.3634 1.3622 3.9787 3.8990 3.9456 3.9225 4.8061 4.1195 3.9442 4.0611 4.0476 4.0481 1.0127 1.0215 1.0102 1.0476 1.0300 1.0117
dispcorr: -0.019982337 hartree
energy: -4066.371684636681
dipole: -9.67696 9.94652 0.26956 5.26443 -4.97170 0.29274 -10.94698 9.70512 -1.24186
magnitude: 1.30406 au
magnitude: 3.31465 debye
