program: Orca
programVersion: 5.0.2
elementType: F F F O O N N N N C C C C C C C C C C C C C C C C C C C C H H H H H H H H H H H H H
charge: 0
multiplicity: 1
keywords: wb97x-d3
keywords: def2-TZVPP
keywords: def2/J RIJCOSX
keywords: DEFGRID2
keywords: scfconv7
keywords: smallprint printgap noloewdin
keywords: NOSOSCF
formula: C20H13F3N4O2
InChI: InChI=1/C20H13F3N4O2/c21-20(22,23)15-5-3-4-14(8-15)17-18(28)26-7-2-1-6-16(26)27(19(17)29)11-13-9-24-12-25-10-13/h1-10,12H,11H2
42 atoms
F  5.367097 1.56041 -1.914407
F  3.375574 2.359402 -2.025446
F  4.685284 2.953787 -0.428597
O  0.0112 1.329068 1.308181
O  0.862618 -3.113982 0.081978
N  -1.684921 -0.169259 1.113708
N  -1.265549 -2.40117 0.555755
N  -3.439163 1.457885 -2.351007
N  -5.337459 2.038566 -1.06657
C  -2.142985 -1.419407 0.880421
C  0.582494 -0.859895 0.698468
C  -2.649295 0.912473 1.291006
C  -0.316076 0.172994 1.052388
C  0.174742 -2.159419 0.422984
C  2.020721 -0.541374 0.60523
C  -3.505724 -1.744233 0.969796
C  -1.68921 -3.674627 0.325106
C  -3.370119 1.2488 0.01753
C  2.46827 0.477581 -0.236012
C  -3.926213 -3.025387 0.740027
C  2.959671 -1.250331 1.350109
C  -2.998684 -4.017253 0.407417
C  3.819628 0.777469 -0.322305
C  4.311862 -0.953646 1.257244
C  4.750296 0.061564 0.424978
C  -2.790667 1.13925 -1.237545
C  -4.675956 1.712994 0.036392
C  4.303408 1.906322 -1.176422
C  -4.6810 1.892521 -2.206792
H  -2.09506 1.777141 1.645371
H  -3.352258 0.663062 2.085528
H  -4.230879 -0.992379 1.232881
H  -0.916822 -4.382823 0.07656
H  1.747014 1.022241 -0.830095
H  -4.977716 -3.262216 0.821547
H  2.634059 -2.035234 2.020559
H  -3.297349 -5.036921 0.219056
H  5.02729 -1.514041 1.843885
H  5.807416 0.287563 0.36916
H  -1.775967 0.776803 -1.363722
H  -5.207174 1.817723 0.976579
H  -5.213901 2.152394 -3.113087
elementType: F O N C H
totalener: -1439.13807273 hartree
nucrepener: 2690.93175246 hartree
electener: -4130.06982519 hartree
oneelecener: -7316.71372629 hartree
twoeener: 3186.64390109 hartree
cpcmener: -0.06912914 hartree
kineticenergy: 1433.52519734 hartree
xcener: -132.157995013907 hartree
chargesum: 0.0000000
charge: -0.187273 -0.183524 -0.186253 -0.558310 -0.551959 -0.048007 0.010389 -0.370074 -0.366699 0.273765 -0.165240 0.025999 0.344129 0.362439 0.029951 -0.226079 0.069583 -0.061089 -0.159445 -0.049874 -0.183494 -0.184582 -0.085582 -0.174358 -0.144215 0.060695 0.010563 0.549233 0.189886 0.132636 0.140064 0.148504 0.172182 0.141607 0.175103 0.149074 0.171745 0.160410 0.150313 0.133967 0.142216 0.141604
qa: -0.1873 -0.1835 -0.1863 -0.5583 -0.5520 -0.0480 0.0104 -0.3701 -0.3667 0.2738 -0.1652 0.0260 0.3441 0.3624 0.0300 -0.2261 0.0696 -0.0611 -0.1594 -0.0499 -0.1835 -0.1846 -0.0856 -0.1744 -0.1442 0.0607 0.0106 0.5492 0.1899 0.1326 0.1401 0.1485 0.1722 0.1416 0.1751 0.1491 0.1717 0.1604 0.1503 0.1340 0.1422 0.1416
va: 1.1096 1.1182 1.1024 1.9619 1.9742 3.2765 3.4737 3.0332 3.0195 4.0090 3.3887 3.7053 4.1697 4.1306 3.5912 3.9197 3.8442 3.6623 3.9388 3.9254 3.9500 3.9478 3.7411 3.9352 3.9663 4.0306 4.0828 4.4351 4.0058 1.0333 0.9904 1.0042 1.0255 1.0308 0.9825 1.0059 0.9887 0.9916 1.0050 1.0186 1.0111 0.9949
dispcorr: -0.021565994 hartree
energy: -1439.159638727558
dipole: -27.37649 22.39339 -4.98311 -14.43391 11.31454 -3.11937 10.04222 -7.92731 2.11491
magnitude: 6.24777 au
magnitude: 15.88057 debye
