program: Orca
programVersion: 5.0.2
elementType: F F F O O N N N N C C C C C C C C C C C C C C C C C C C C H H H H H H H H H H H H H
charge: 0
multiplicity: 1
keywords: wb97x-d3
keywords: def2-TZVPP
keywords: def2/J RIJCOSX
keywords: DEFGRID2
keywords: scfconv7
keywords: smallprint printgap noloewdin
keywords: NOSOSCF
formula: C20H13F3N4O2
InChI: InChI=1/C20H13F3N4O2/c21-20(22,23)15-5-3-4-14(8-15)17-18(28)26-7-2-1-6-16(26)27(19(17)29)11-13-9-24-12-25-10-13/h1-10,12H,11H2
42 atoms
F  6.14025 0.458083 1.088025
F  4.779162 1.570277 2.325358
F  4.546296 -0.554494 2.116119
O  -0.612186 1.888213 -1.144832
O  1.294427 -2.35072 -0.515539
N  -1.909666 0.029272 -1.036585
N  -0.978105 -2.072081 -0.625114
N  -4.03671 1.616377 2.28858
N  -5.9884 1.61455 0.963274
C  -2.070193 -1.29203 -0.817714
C  0.483961 -0.162457 -0.835728
C  -3.082832 0.860733 -1.27798
C  -0.644746 0.671468 -1.014254
C  0.393476 -1.538699 -0.655327
C  1.824914 0.453188 -0.824622
C  -3.336879 -1.899322 -0.778084
C  -1.096371 -3.407707 -0.398219
C  -3.877176 1.157113 -0.038531
C  2.686401 0.230651 0.248399
C  -3.450966 -3.243434 -0.551939
C  2.266541 1.25588 -1.874947
C  -2.305644 -4.020912 -0.354519
C  3.958133 0.784351 0.263942
C  3.533062 1.82049 -1.851976
C  4.387483 1.588985 -0.786274
C  -3.310892 1.323164 1.217473
C  -5.254051 1.31677 -0.098781
C  4.852821 0.560479 1.442293
C  -5.340208 1.751487 2.109003
H  -3.711597 0.395338 -2.037946
H  -2.724089 1.79108 -1.712394
H  -4.228087 -1.311932 -0.922662
H  -0.165308 -3.932505 -0.258187
H  2.34525 -0.3747 1.077395
H  -4.43271 -3.695957 -0.523621
H  1.622381 1.430206 -2.727246
H  -2.361091 -5.082955 -0.169795
H  3.860521 2.439956 -2.676778
H  5.374637 2.0328 -0.785811
H  -2.243392 1.211285 1.377156
H  -5.781179 1.19331 -1.040416
H  -5.934086 1.995751 2.98224
elementType: F O N C H
totalener: -1439.14218882 hartree
nucrepener: 2672.07131855 hartree
electener: -4111.21350737 hartree
oneelecener: -7278.92584430 hartree
twoeener: 3167.71233693 hartree
cpcmener: -0.05546792 hartree
kineticenergy: 1433.52067562 hartree
xcener: -132.153971371231 hartree
chargesum: -0.0000000
charge: -0.185265 -0.185515 -0.183974 -0.522586 -0.512763 -0.040248 -0.002454 -0.362240 -0.359666 0.278865 -0.186660 0.022469 0.325214 0.342344 0.046063 -0.223371 0.067076 -0.072396 -0.161952 -0.057923 -0.179019 -0.183118 -0.079843 -0.169562 -0.140422 0.057289 0.008761 0.546598 0.186412 0.139902 0.130669 0.146665 0.172384 0.136135 0.170867 0.142125 0.168637 0.156475 0.148772 0.135155 0.139169 0.140935
qa: -0.1853 -0.1855 -0.1840 -0.5226 -0.5128 -0.0402 -0.0025 -0.3622 -0.3597 0.2789 -0.1867 0.0225 0.3252 0.3423 0.0461 -0.2234 0.0671 -0.0724 -0.1620 -0.0579 -0.1790 -0.1831 -0.0798 -0.1696 -0.1404 0.0573 0.0088 0.5466 0.1864 0.1399 0.1307 0.1467 0.1724 0.1361 0.1709 0.1421 0.1686 0.1565 0.1488 0.1352 0.1392 0.1409
va: 1.1128 1.1012 1.1161 1.9994 2.0250 3.2787 3.4790 3.0357 3.0241 4.0150 3.3997 3.7222 4.1826 4.1556 3.5809 3.9150 3.8441 3.6504 3.9762 3.9348 3.9692 3.9436 3.7457 3.9442 3.9631 4.0349 4.0855 4.4385 4.0088 0.9895 1.0308 1.0051 1.0273 1.0300 0.9843 1.0113 0.9901 0.9927 1.0056 1.0170 1.0107 0.9947
dispcorr: -0.021191270 hartree
energy: -1439.163380094566
dipole: -31.45797 26.93200 -4.52597 -3.48476 0.71434 -2.77043 -12.35219 10.35382 -1.99836
magnitude: 5.67037 au
magnitude: 14.41294 debye
