program: Orca
programVersion: 5.0.2
elementType: F F F O O N N N N C C C C C C C C C C C C C C C C C C C C H H H H H H H H H H H H H
charge: 0
multiplicity: 1
keywords: wb97x-d3
keywords: def2-TZVPP
keywords: def2/J RIJCOSX
keywords: DEFGRID2
keywords: scfconv7
keywords: smallprint printgap noloewdin
keywords: NOSOSCF
formula: C20H13F3N4O2
InChI: InChI=1/C20H13F3N4O2/c21-20(22,23)15-5-3-4-14(8-15)17-18(28)26-7-2-1-6-16(26)27(19(17)29)11-13-9-24-12-25-10-13/h1-10,12H,11H2
42 atoms
F  4.974981 1.083047 -2.359279
F  3.280792 2.3584 -2.000557
F  5.093973 2.628095 -0.871054
O  -0.113214 1.350003 1.01249
O  0.931492 -3.213056 0.554201
N  -1.736462 -0.232297 1.010832
N  -1.238149 -2.473924 0.662273
N  -3.340876 2.223191 -2.162643
N  -5.422197 1.859496 -1.103932
C  -2.156749 -1.491496 0.822148
C  0.58923 -0.880564 0.763208
C  -2.699139 0.833561 1.271432
C  -0.353751 0.16136 0.929584
C  0.240472 -2.225372 0.664016
C  2.018666 -0.525875 0.675492
C  -3.519575 -1.848364 0.784315
C  -1.607325 -3.76452 0.47717
C  -3.400002 1.329293 0.039168
C  2.453591 0.416013 -0.255396
C  -3.888101 -3.151285 0.594926
C  2.962242 -1.135436 1.494824
C  -2.912177 -4.140872 0.438211
C  3.796332 0.735277 -0.363904
C  4.306438 -0.812219 1.389557
C  4.731467 0.120755 0.462122
C  -2.714246 1.777434 -1.087102
C  -4.781468 1.410962 -0.036176
C  4.277678 1.705661 -1.397625
C  -4.664428 2.238159 -2.119086
H  -2.133459 1.644369 1.725775
H  -3.421568 0.495586 2.017103
H  -4.277255 -1.089995 0.881187
H  -0.777813 -4.446045 0.36593
H  1.729999 0.890945 -0.901658
H  -4.938382 -3.406485 0.560838
H  2.645857 -1.86774 2.224725
H  -3.169351 -5.177382 0.284324
H  5.026801 -1.293321 2.03754
H  5.782993 0.364771 0.38627
H  -1.630036 1.787726 -1.114396
H  -5.401353 1.106286 0.804992
H  -5.176696 2.601299 -3.002612
totalener: -1439.10052247 hartree
nucrepener: 2681.55863602 hartree
electener: -4120.65915849 hartree
oneelecener: -7297.62404248 hartree
twoeener: 3176.96488399 hartree
kineticenergy: 1433.59056345 hartree
xcener: -132.154415624416 hartree
chargesum: 0.0000000
charge: -0.176143 -0.175944 -0.178447 -0.413506 -0.405072 -0.048575 -0.031085 -0.284063 -0.291209 0.272191 -0.261317 -0.047056 0.305195 0.295543 0.122356 -0.224377 0.045063 -0.054825 -0.112871 -0.072453 -0.130413 -0.155755 -0.099702 -0.142035 -0.128039 0.021626 -0.016826 0.536603 0.157832 0.148191 0.126012 0.112017 0.173064 0.114058 0.146150 0.109688 0.144168 0.121454 0.118568 0.141651 0.110036 0.128243
qa: -0.1761 -0.1759 -0.1784 -0.4135 -0.4051 -0.0486 -0.0311 -0.2841 -0.2912 0.2722 -0.2613 -0.0471 0.3052 0.2955 0.1224 -0.2244 0.0451 -0.0548 -0.1129 -0.0725 -0.1304 -0.1558 -0.0997 -0.1420 -0.1280 0.0216 -0.0168 0.5366 0.1578 0.1482 0.1260 0.1120 0.1731 0.1141 0.1461 0.1097 0.1442 0.1215 0.1186 0.1417 0.1100 0.1282
va: 1.1177 1.1287 1.1215 2.1018 2.1361 3.2782 3.4922 3.0575 3.0651 4.0071 3.5182 3.7784 4.1556 4.1450 3.6048 3.9540 3.8729 3.5548 3.9976 3.9965 4.0155 3.9411 3.8668 3.9720 4.0223 4.0575 4.1010 4.4470 4.0305 1.0292 0.9913 1.0350 1.0339 1.0339 0.9943 1.0145 1.0005 1.0031 1.0152 1.0239 1.0098 0.9936
dispcorr: -0.021163424 hartree
energy: -1439.121685890771
dipole: -27.15310 23.84068 -3.31242 -13.16438 10.89232 -2.27206 11.30639 -9.91129 1.39511
magnitude: 4.25214 au
magnitude: 10.80808 debye
