program: Orca
programVersion: 5.0.2
elementType: F F F O O N N N N C C C C C C C C C C C C C C C C C C C C H H H H H H H H H H H H H
charge: 0
multiplicity: 1
keywords: wb97x-d3
keywords: def2-TZVPP
keywords: def2/J RIJCOSX
keywords: DEFGRID2
keywords: scfconv7
keywords: smallprint printgap noloewdin
keywords: NOSOSCF
formula: C20H13F3N4O2
InChI: InChI=1/C20H13F3N4O2/c21-20(22,23)15-5-3-4-14(8-15)17-18(28)26-7-2-1-6-16(26)27(19(17)29)11-13-9-24-12-25-10-13/h1-10,12H,11H2
42 atoms
F  4.296875 -0.333554 -2.461595
F  5.571633 1.336389 -1.988992
F  5.834583 -0.536672 -0.970053
O  -0.644801 1.965609 1.062573
O  1.273153 -2.307187 0.610915
N  -1.922437 0.093916 1.081357
N  -0.994045 -2.012051 0.77639
N  -5.998515 1.297701 -1.053391
N  -4.020645 1.74684 -2.265073
C  -2.086541 -1.229119 0.937745
C  0.487003 -0.084355 0.823099
C  -3.082446 0.952551 1.286486
C  -0.643547 0.75232 0.992205
C  0.404199 -1.473277 0.732396
C  1.819759 0.541335 0.725501
C  -3.351678 -1.849989 0.950003
C  -1.101764 -3.355723 0.637314
C  -3.885298 1.17872 0.038366
C  2.700122 0.164385 -0.287263
C  -3.456395 -3.20564 0.807007
C  2.233128 1.514245 1.631658
C  -2.306077 -3.985096 0.64846
C  3.954273 0.743236 -0.391165
C  3.488302 2.091542 1.527788
C  4.356695 1.711177 0.520712
C  -5.268023 1.083362 0.028892
C  -3.303736 1.534939 -1.174449
C  4.908673 0.301342 -1.456313
C  -5.332968 1.61535 -2.15105
H  -2.690772 1.900674 1.649937
H  -3.707983 0.541909 2.082243
H  -4.243127 -1.255263 1.051875
H  -0.155927 -3.862016 0.519447
H  2.392086 -0.583408 -1.002855
H  -4.434587 -3.666575 0.811836
H  1.572371 1.824259 2.42836
H  -2.354363 -5.056601 0.531157
H  3.791242 2.846037 2.241111
H  5.333056 2.171379 0.448354
H  -5.811104 0.823948 0.935325
H  -2.22992 1.659838 -1.266896
H  -5.919906 1.788523 -3.045701
totalener: -1439.10109047 hartree
nucrepener: 2671.77342025 hartree
electener: -4110.87451071 hartree
oneelecener: -7278.00848613 hartree
twoeener: 3167.13397542 hartree
kineticenergy: 1433.59548793 hartree
xcener: -132.156448179306 hartree
chargesum: -0.0000000
charge: -0.178397 -0.179647 -0.173258 -0.415923 -0.405298 -0.046996 -0.030467 -0.289598 -0.285429 0.265410 -0.241437 -0.037032 0.278234 0.301892 0.111823 -0.222477 0.046592 -0.051674 -0.110331 -0.067732 -0.120528 -0.156992 -0.106223 -0.147921 -0.115438 -0.025331 0.024315 0.535376 0.156733 0.144273 0.125295 0.113267 0.173918 0.114868 0.145779 0.106650 0.144529 0.120196 0.120863 0.112243 0.137583 0.128291
qa: -0.1784 -0.1796 -0.1733 -0.4159 -0.4053 -0.0470 -0.0305 -0.2896 -0.2854 0.2654 -0.2414 -0.0370 0.2782 0.3019 0.1118 -0.2225 0.0466 -0.0517 -0.1103 -0.0677 -0.1205 -0.1570 -0.1062 -0.1479 -0.1154 -0.0253 0.0243 0.5354 0.1567 0.1443 0.1253 0.1133 0.1739 0.1149 0.1458 0.1067 0.1445 0.1202 0.1209 0.1122 0.1376 0.1283
va: 1.1249 1.1194 1.1197 2.0997 2.1319 3.2707 3.4918 3.0640 3.0589 4.0163 3.5201 3.7612 4.1634 4.1291 3.6044 3.9575 3.8720 3.5590 3.9934 3.9909 4.0211 3.9420 3.8618 3.9881 4.0094 4.1065 4.0565 4.4486 4.0304 1.0353 0.9906 1.0318 1.0334 1.0349 0.9944 1.0212 1.0005 1.0036 1.0142 1.0103 1.0183 0.9936
dispcorr: -0.021077396 hartree
energy: -1439.122167861923
dipole: -31.80752 28.49102 -3.31650 -1.39417 -0.38129 -1.77546 12.13841 -10.61251 1.52590
magnitude: 4.05953 au
magnitude: 10.31851 debye
