program: Orca
programVersion: 5.0.3
elementType: Cl S O O O N N N N N C C C C C C C C H H H H H H H H H H
charge: 0
multiplicity: 1
keywords: wb97x-d3
keywords: def2-TZVPP
keywords: def2/J RIJCOSX
keywords: DEFGRID2
keywords: scfconv7
keywords: smallprint printgap noloewdin
keywords: NOSOSCF
formula: C8H10ClN5O3S
InChI: InChI=1/C8H10ClN5O3S/c1-12-4-17-5-13(8(12)11-14(15)16)3-6-2-10-7(9)18-6/h2H,3-5H2,1H3
28 atoms
Cl -3.834361 -2.365039 0.722282
S  -2.135271 -0.972008 -1.269328
O  1.230139 3.111246 0.742295
O  1.324127 -1.230521 1.121029
O  1.709574 -2.590153 -0.489361
N  0.889049 1.642923 -1.026671
N  2.635923 1.258988 0.406158
N  1.740264 -0.478572 -0.929669
N  -2.258336 -0.296595 1.191409
N  1.603605 -1.448044 -0.059562
C  0.978291 3.036847 -0.636883
C  1.748858 0.787872 -0.455438
C  -0.30083 1.130579 -1.686917
C  2.482316 2.576162 1.028494
C  -1.182041 0.36656 -0.746774
C  3.761849 0.490437 0.897747
C  -1.382975 0.558434 0.581917
C  -2.716274 -1.138439 0.339107
H  1.770704 3.537839 -1.202964
H  0.030339 3.526471 -0.84021
H  -0.015465 0.516831 -2.539994
H  -0.836801 1.986642 -2.096424
H  2.552137 2.454354 2.10991
H  3.297709 3.224065 0.687679
H  4.606131 1.166396 1.025288
H  4.055108 -0.269687 0.179336
H  3.54209 0.026216 1.85798
H  -0.902511 1.324631 1.172445
elementType: Cl S O N C H
totalener: -1668.68337630 hartree
nucrepener: 1702.91734460 hartree
electener: -3371.60072089 hartree
oneelecener: -5676.80429330 hartree
twoeener: 2305.20357240 hartree
cpcmener: -0.06412274 hartree
kineticenergy: 1664.21498205 hartree
xcener: -114.861722879823 hartree
chargesum: 0.0000000
charge: -0.029882 0.080305 -0.369890 -0.499992 -0.505060 -0.109992 -0.041343 -0.391575 -0.286542 0.590118 0.098757 0.235835 0.025821 0.092506 -0.026889 -0.178428 -0.082383 0.073718 0.137543 0.134635 0.125556 0.131193 0.133591 0.135474 0.126028 0.126167 0.130048 0.144683
qa: -0.0299 0.0803 -0.3699 -0.5000 -0.5051 -0.1100 -0.0413 -0.3916 -0.2865 0.5901 0.0988 0.2358 0.0258 0.0925 -0.0269 -0.1784 -0.0824 0.0737 0.1375 0.1346 0.1256 0.1312 0.1336 0.1355 0.1260 0.1262 0.1300 0.1447
va: 1.2766 2.7673 1.9802 1.7357 1.7223 3.2031 3.2888 2.7302 3.0395 4.2282 3.9164 4.3580 3.7874 3.9323 3.7513 3.8795 4.0420 4.2521 0.9889 0.9900 1.0096 0.9943 0.9846 0.9880 0.9957 0.9970 0.9941 1.0359
dispcorr: -0.015739634 hartree
energy: -1668.699115929450
dipole: 22.62768 -20.96559 1.66209 19.75852 -14.39817 5.36035 -0.39612 -0.97935 -1.37547
magnitude: 5.77822 au
magnitude: 14.68706 debye
