program: Gaussian 09
title: 000006585
version: EM64L-G09RevD.01
frameworkgroup: C1[X(C2H4O3)]
method: RPBEPBE
basis: SDD
operation: Freq
keyword: #p
keyword: freq=noraman
keyword: PBEPBE/SDD
title: #p freq=noraman PBEPBE/SDD
converged: YES YES NO YES
title: Mulliken charges:
elementType: O O O C C H H H H
charge: -0.139443 -0.272694 -0.327962 -0.726725 0.302363 0.261234 0.260509 0.260533 0.382185
chargesum: 0.00000
title: Mulliken charges with hydrogens summed into heavy atoms:
elementType: O O O C C
charge: -0.139443 -0.272694 0.054223 0.055550 0.302363
polarizability: 4.87499423e+01 -7.24569244e-01 3.52950248e+01 -2.94108538e-03 2.18828582e-03 1.98109042e+01
1716.lowfreq: -9.1974 -7.4192 -0.0011 -0.0006 0.0003 5.2441 91.6631 210.7617 277.0495
frequency: 91.6598 210.7611 277.0488 395.9804 435.1440 586.0439 616.2836 809.4439 869.5139 988.2306 1038.9002 1176.9863 1379.7263 1391.9948 1450.9732 1454.4523 1653.5451 3010.1286 3102.4583 3135.0773 3148.2287
redmass: 1.1134 4.9601 4.5199 4.0618 1.1943 2.6455 5.0603 5.9980 10.0849 2.1646 1.5594 3.3981 1.1798 1.2089 1.0446 1.0665 8.1466 1.0359 1.0981 1.1010 1.0655
irintensity: 0.7008 0.1153 18.3218 8.6412 118.0725 40.3809 6.9707 46.6207 3.2271 5.9610 13.8116 145.5976 55.7333 92.7298 20.5348 18.0252 158.0790 0.3242 3.1572 3.3210 19.2552
temp: 298.150 k
press: 1.00000 atm
elementType: 8 8 8 6 6 1 1 1 1
symmnumber: 1
zpe: 162827.2 jmol-1
zpe.correction: 0.062018 hartree
zpe.thermalcorrener: 0.067759 hartree
zpe.thermalcorrenthalpy: 0.068703 hartree
zpe.thermalcorrgfe: 0.033125 hartree
zpe.sumelectzpe: -303.801390 hartree
zpe.sumelectthermal: -303.795648 hartree
zpe.sumelectthermalent: -303.794704 hartree
zpe.sumelectthermalfe: -303.830283 hartree
dipole: 2.7502 -0.2237 0.0010
dipole: 2.7593
quadrupole: -26.5238 -33.1683 -28.6346
quadrupole: -4.9003 -0.0009 0.0011
quadrupole: 2.9184 -3.7261 0.8076 -4.9003 -0.0009 0.0011
hfenergy: -303.8634073 hartree
pointgroup: C01 [X(C2H4O3)]
dipole: -1.0662333 0.08478 -0.1856014 debye
dipolederiv: -0.2944844 -0.1734857 -0.1079734 -0.4372612 -0.4588109 -0.2310393 -0.216885 -0.1763978 -0.2365534 -0.5285526 0.2354534 0.0564116 -0.0833876 -0.8698304 -0.2398738 -0.0752388 -0.1733663 -0.4184738 -0.3752512 -0.0537348 -0.0289779 0.1761658 -0.1337352 0.1225384 0.0658151 0.0748415 -0.2977319 -0.3583391 0.1202223 -0.0292931 0.0139887 -0.0301932 -0.0192742 -0.0727114 0.0025826 0.0094172 0.97431 -0.052352 0.1368261 0.3428363 1.1783804 0.4716686 0.2997528 0.3894848 0.4316251 0.113741 -0.0192691 -0.0138436 0.014588 -0.0242898 -0.0655995 0.0000422 -0.0725836 0.1125539 0.0785181 0.0136209 -0.0306409 0.0280568 0.129118 -0.0217344 -0.0434749 -0.0045676 -0.0368682 0.0385395 -0.0383349 0.0383249 -0.0434933 0.0414902 0.0765211 0.0549931 0.0574933 0.0907021 0.3515187 -0.0321201 -0.0208338 -0.0114935 0.1678708 -0.093207 -0.0122932 -0.0974869 0.3453291 unknown
polarizability: 47.7558339|-1.7916144|33.1254364|5.0569195|5.1237911|22.974601 unknown
InChI: InChI=1S/C2H4O3/c1-2(3)5-4/h4H,1H3
charge 0 multiplicity 1
9 atoms
O  0.52172 0.948441 0.59227
O  0.04475 -1.113506 -0.357758
O  1.925873 0.391836 0.654044
C  -1.759823 0.57665 -0.033729
C  -0.367538 0.009071 0.019906
H  -1.794298 1.595994 0.378616
H  -2.10692 0.590673 -1.081224
H  -2.440833 -0.076224 0.538851
H  1.784768 -0.533136 0.243224
