program: Orca
programVersion: 5.0.3
elementType: Cl S O O O N N N N N C C C C C C C C H H H H H H H H H H
charge: 0
multiplicity: 1
keywords: wb97x-d3
keywords: def2-TZVPP
keywords: def2/J RIJCOSX
keywords: DEFGRID2
keywords: scfconv7
keywords: smallprint printgap noloewdin
keywords: NOSOSCF
formula: C8H10ClN5O3S
InChI: InChI=1/C8H10ClN5O3S/c1-12-4-17-5-13(8(12)11-14(15)16)3-6-2-10-7(9)18-6/h2H,3-5H2,1H3
28 atoms
Cl -4.277026 -1.945399 -0.530993
S  -2.344108 -0.78365 1.392906
O  1.128303 2.998905 -0.764975
O  2.203054 -2.662244 0.294591
O  1.548288 -1.32801 -1.247571
N  1.003399 1.481725 0.992266
N  2.680521 1.247293 -0.550841
N  1.998613 -0.573273 0.795101
N  -2.273049 -0.326335 -1.120361
N  1.926456 -1.535108 -0.093496
C  0.973878 2.88458 0.625082
C  1.882335 0.696541 0.35119
C  -0.108708 0.890868 1.711178
C  2.389587 2.553398 -1.145976
C  -1.10938 0.262194 0.791638
C  3.843799 0.584784 -1.104927
C  -1.240999 0.371742 -0.554693
C  -2.920497 -0.96478 -0.217491
H  0.010714 3.306391 0.898309
H  1.766055 3.428761 1.150059
H  -0.575511 1.681959 2.298671
H  0.266991 0.162663 2.428035
H  3.181153 3.254079 -0.857008
H  2.389409 2.44445 -2.231082
H  3.619426 0.104472 -2.056243
H  4.242395 -0.147072 -0.407717
H  4.615851 1.334987 -1.270015
H  -0.607876 0.968747 -1.193526
elementType: Cl S O N C H
totalener: -1668.68423220 hartree
nucrepener: 1683.44105119 hartree
electener: -3352.12528340 hartree
oneelecener: -5637.39984917 hartree
twoeener: 2285.27456577 hartree
cpcmener: -0.06230563 hartree
kineticenergy: 1664.21706010 hartree
xcener: -114.862258394901 hartree
chargesum: 0.0000000
charge: -0.028916 0.075813 -0.370366 -0.500214 -0.499308 -0.115337 -0.045711 -0.388679 -0.290012 0.592773 0.091807 0.223900 0.013300 0.092808 -0.028948 -0.177938 -0.062505 0.074026 0.138456 0.138063 0.139219 0.134492 0.137069 0.135652 0.130557 0.126068 0.124758 0.139171
qa: -0.0289 0.0758 -0.3704 -0.5002 -0.4993 -0.1153 -0.0457 -0.3887 -0.2900 0.5928 0.0918 0.2239 0.0133 0.0928 -0.0289 -0.1779 -0.0625 0.0740 0.1385 0.1381 0.1392 0.1345 0.1371 0.1357 0.1306 0.1261 0.1248 0.1392
va: 1.2780 2.7569 1.9791 1.7323 1.7377 3.1958 3.2869 2.7315 3.0515 4.2342 3.9286 4.3719 3.7887 3.9227 3.7396 3.8784 4.0352 4.2524 0.9880 0.9891 0.9932 1.0077 0.9889 0.9858 0.9942 0.9973 0.9964 1.0443
dispcorr: -0.015266342 hartree
energy: -1668.699498544439
dipole: 23.93657 -22.60039 1.33618 18.18558 -12.91878 5.26680 -0.59679 2.03104 1.43424
magnitude: 5.61975 au
magnitude: 14.28428 debye
